{"text_format":"1","workbook":"xlsx","n_sheets":4,"sheets":["Individual Calculator","Multiple Calculator","BaseRate&Factors","Sheet3"],"not_rendered":{"charts":0,"images":0,"macros":1,"external_links":0,"defined_names":10,"comments":0,"pivot_tables":0},"unopened":[],"bounds":{"document_bytes":16777216,"sheet_cells":100000,"rows_first":2000,"rows_last":500,"rows_between":2000,"halvings":0,"cell_chars":16384,"cell_head_chars":4096},"cells_cut":0,"cells_raw":0,"read":"whole","date_system":"1900"}

{"sheet":"Individual Calculator","index":0,"n_rows":44,"n_cols":10,"rows_kept":44,"cut":false,"hidden":false,"merged":[[34,6,35,6],[39,1,40,1],[39,2,40,2],[34,4,35,4],[34,0,35,0],[2,2,2,6],[38,1,38,5],[5,5,5,6],[38,7,40,8],[39,3,40,3],[39,4,40,4],[39,5,40,5],[39,6,40,6],[32,1,33,3],[32,4,33,8],[34,7,35,7],[34,8,35,8],[34,3,35,3],[34,1,35,1],[34,2,35,2],[34,5,35,5]]}
[]
[]
[null,null,"Short Term Medical Premium Calculator"]
[null,null,null,null,"Requested Effective Date (MM/DD/YYYY)"]
[]
[null,null,"State",null,null,{"$f":"IF(D6=\"MO\", \"MO allows up to 6 months of coverage\", IF(D6=\"SC\",\"SC allows up to 11 months of coverage\",\"\"))","v":""}]
[null,null,"Zip Code",null,null,"Coverage (# of Month)"]
[null,null,"Deductible (One Insured / Two or more Insured)",null,null,"Single Payment"]
[null,null,"Coinsurance"]
[]
{"$rows_left_out":35}
{"sheet":"Multiple Calculator","index":1,"n_rows":93,"n_cols":33,"rows_kept":93,"cut":false,"hidden":true,"merged":[[7,4,8,4],[7,1,8,1],[7,15,8,15],[7,6,8,6],[7,7,8,7],[7,5,8,5],[7,11,8,11],[7,14,8,14],[2,0,2,32],[5,0,6,5],[7,0,8,0],[3,0,3,32],[5,31,8,31],[7,27,8,27],[7,22,8,22],[7,23,8,23],[7,2,8,2],[7,8,8,8],[7,21,8,21],[7,16,8,16],[7,17,8,17],[7,19,8,19],[7,20,8,20],[7,3,8,3],[5,32,8,32],[5,9,6,18],[5,19,6,28],[5,29,6,30],[7,28,8,28],[7,29,8,29],[7,30,8,30],[7,25,8,25],[7,26,8,26],[7,18,8,18],[7,9,8,9],[7,10,8,10],[7,12,8,12],[7,24,8,24],[7,13,8,13]]}
[]
[]
["Short Term Major Medical Premium Calculator"]
["Effective on 1/20/2015"]
[]
["Policy Selection",null,null,null,null,null,null,null,null,"Primary Insured",null,null,null,null,null,null,null,null,null,"Spouse",null,null,null,null,null,null,null,null,null,"Children",null,"Total Premium","Equivalent to $$/Month"]
[]
["State","Zipcode","Coinsurance","Deductible","Period (# of Month)","Single Payment?","Coinsurance Factor","Area Factor","Sngl Pymt factor","Last Name","First Name","Age","Gender","Rate Type","Primary BASE RATE",1000,2500,5000,10000,"Last Name","First Name","Age","Gender","Rate Type","Spouse BASE RATE",1000,2500,5000,10000,"Number of Dependent Children","Children Premium"]
[]
[null,null,null,null,null,null,{"$f":"IF(AND(ISBLANK(C10), ISBLANK(D10)), \"\", IF(OR(ISBLANK(C10), ISBLANK(D10)), \"F\", SUMIFS(Sheet3!$C$10:$C$17, Sheet3!$A$10:$A$17, 'Multiple Calculator'!D10, Sheet3!$B$10:$B$17, 'Multiple Calculator'!C10)))","v":""},{"$f":"IF(AND(G10=\"\", I10=\"\"), 0, IF(OR(G10=\"F\", I10=\"F\"), \"F\", IF(OR(ISBLANK(A10), ISBLANK(B10)), \"F\",IF(ISNUMBER(VLOOKUP(A10&\"-\"&LEFT(B10, 3), Sheet3!I:J, 2, FALSE)), VLOOKUP(A10&\"-\"&LEFT(B10, 3), Sheet3!I:J, 2, FALSE), VLOOKUP(A10, Sheet3!I:J, 2, FALSE)))))","v":0},{"$f":"IF(AND(ISBLANK(E10), ISBLANK(F10)), \"\", IF(OR(ISBLANK(E10), ISBLANK(F10)), \"F\", IF(F10=\"Yes\", IF(E10>=3, Sheet3!$C$22, Sheet3!$C$21), Sheet3!$C$21)))","v":""},null,null,null,null,null,{"$f":"IF(AND(ISBLANK(L10), ISBLANK(M10), ISBLANK(N10)), 0, IF(OR(ISBLANK(L10), ISBLANK(M10), ISBLANK(N10)), \"F\", IF(D10=$P$8,P10,IF(D10=$Q$8,Q10,IF(D10=$R$8,R10,S10)))))","v":0},{"$f":"IF(M10=\"Female\", IF(N10=\"Non-Tobacco\", VLOOKUP(L10, 'BaseRate&Factors'!$A$9:$D$73, 4,FALSE), VLOOKUP(L10, 'BaseRate&Factors'!$A$9:$E$73, 5,FALSE)), IF(N10=\"Non-Tobacco\", VLOOKUP(L10, 'BaseRate&Factors'!$A$9:$C$73, 2,FALSE), VLOOKUP(L10, 'BaseRate&Factors'!$A$9:$E$73, 3,FALSE)))","v":134.41},{"$f":"IF(M10=\"Female\", IF(N10=\"Non-Tobacco\", VLOOKUP(L10, 'BaseRate&Factors'!$A$9:$I$73, 8,FALSE), VLOOKUP(L10, 'BaseRate&Factors'!$A$9:$I$73, 9,FALSE)), IF(N10=\"Non-Tobacco\", VLOOKUP(L10, 'BaseRate&Factors'!$A$9:$I$73, 6,FALSE), VLOOKUP(L10, 'BaseRate&Factors'!$A$9:$I$73, 7,FALSE)))","v":91.05},{"$f":"IF(M10=\"Female\", IF(N10=\"Non-Tobacco\", VLOOKUP(L10, 'BaseRate&Factors'!$A$9:$M$73, 12,FALSE), VLOOKUP(L10, 'BaseRate&Factors'!$A$9:$M$73, 13,FALSE)), IF(N10=\"Non-Tobacco\", VLOOKUP(L10, 'BaseRate&Factors'!$A$9:$M$73, 10,FALSE), VLOOKUP(L10, 'BaseRate&Factors'!$A$9:$M$73, 11,FALSE)))","v":70.91},{"$f":"IF(M10=\"Female\", IF(N10=\"Non-Tobacco\", VLOOKUP(L10, 'BaseRate&Factors'!$A$9:$Q$73, 16,FALSE), VLOOKUP(L10, 'BaseRate&Factors'!$A$9:$Q$73,17,FALSE)), IF(N10=\"Non-Tobacco\", VLOOKUP(L10, 'BaseRate&Factors'!$A$9:$Q$73, 14,FALSE), VLOOKUP(L10, 'BaseRate&Factors'!$A$9:$Q$73, 15,FALSE)))","v":55.8},null,null,null,null,null,{"$f":"IF(AND(ISBLANK(V10), ISBLANK(W10), ISBLANK(X10)), 0, IF(OR(ISBLANK(V10), ISBLANK(W10), ISBLANK(X10)), \"F\", IF(D10=$Z$8,Z10,IF(D10=$AA$8,AA10,IF(D10=$AB$8,AB10,AC10)))))","v":0},{"$f":"IF(W10=\"Female\", IF(X10=\"Non-Tobacco\", VLOOKUP(V10, 'BaseRate&Factors'!$A$9:$D$73, 4,FALSE), VLOOKUP(V10, 'BaseRate&Factors'!$A$9:$E$73, 5,FALSE)), IF(X10=\"Non-Tobacco\", VLOOKUP(V10, 'BaseRate&Factors'!$A$9:$C$73, 2,FALSE), VLOOKUP(V10, 'BaseRate&Factors'!$A$9:$E$73, 3,FALSE)))","v":134.41},{"$f":"IF(W10=\"Female\", IF(X10=\"Non-Tobacco\", VLOOKUP(V10, 'BaseRate&Factors'!$A$9:$I$73, 8,FALSE), VLOOKUP(V10, 'BaseRate&Factors'!$A$9:$I$73, 9,FALSE)), IF(X10=\"Non-Tobacco\", VLOOKUP(V10, 'BaseRate&Factors'!$A$9:$I$73, 6,FALSE), VLOOKUP(V10, 'BaseRate&Factors'!$A$9:$I$73, 7,FALSE)))","v":91.05},{"$f":"IF(W10=\"Female\", IF(X10=\"Non-Tobacco\", VLOOKUP(V10, 'BaseRate&Factors'!$A$9:$M$73, 12,FALSE), VLOOKUP(V10, 'BaseRate&Factors'!$A$9:$M$73, 13,FALSE)), IF(X10=\"Non-Tobacco\", VLOOKUP(V10, 'BaseRate&Factors'!$A$9:$M$73, 10,FALSE), VLOOKUP(V10, 'BaseRate&Factors'!$A$9:$M$73, 11,FALSE)))","v":70.91},{"$f":"IF(W10=\"Female\", IF(X10=\"Non-Tobacco\", VLOOKUP(V10, 'BaseRate&Factors'!$A$9:$Q$73, 16,FALSE), VLOOKUP(V10, 'BaseRate&Factors'!$A$9:$Q$73,17,FALSE)), IF(X10=\"Non-Tobacco\", VLOOKUP(V10, 'BaseRate&Factors'!$A$9:$Q$73, 14,FALSE), VLOOKUP(V10, 'BaseRate&Factors'!$A$9:$Q$73, 15,FALSE)))","v":55.8},null,{"$f":"IF(ISBLANK(D10), 0, AD10*VLOOKUP(D10, Sheet3!$A$25:$B$28, 2, FALSE))","v":0},{"$f":"IF(AND(H10=0, O10=0, Y10=0), \"\", IF(OR(H10=\"F\", O10=\"F\", Y10=\"F\"),\"Please verify policy and insured info\", ROUND((O10+Y10+AE10)*G10*H10*I10*E10, 2)))","v":""},{"$f":"IF(ISNUMBER(AF10), ROUND(AF10/E10, 2), \"\")","v":""}]
{"$rows_left_out":84}
{"sheet":"BaseRate&Factors","index":2,"n_rows":104,"n_cols":17,"rows_kept":104,"cut":false,"hidden":true,"merged":[[6,11,6,12],[6,15,6,16],[1,0,1,16],[2,0,2,16],[3,0,3,16],[5,9,5,12],[5,13,5,16],[74,1,74,4],[74,5,74,8],[74,9,74,12],[74,13,74,16],[76,0,77,0],[76,1,76,4]]}
[]
["Short Term Major Medical"]
["Proposed Monthly Premium as of 12/5/2014"]
[]
[]
[null,"     $1,000 Deductible",null,null,null,"     $2,500 Deductible",null,null,null,"     $5,000 Deductible",null,null,null,"     $10,000 Deductible"]
["Age","Male",null,"Female",null,"Male",null,"Female",null,"Male",null,"Female",null,"Male",null,"Female"]
[null,"NTU","STD","NTU","STD","NTU","STD","NTU","STD","NTU","STD","NTU","STD","NTU","STD","NTU","STD"]
[0,134.41,134.41,134.41,134.41,91.05,91.05,91.05,91.05,70.91,70.91,70.91,70.91,55.8,55.8,55.8,55.8]
[1,134.41,134.41,134.41,134.41,91.05,91.05,91.05,91.05,70.91,70.91,70.91,70.91,55.8,55.8,55.8,55.8]
{"$rows_left_out":95}
{"sheet":"Sheet3","index":3,"n_rows":66,"n_cols":16,"rows_kept":66,"cut":false,"hidden":true,"merged":[]}
["Password","STMM",null,null,null,null,"States",null,"Zip","Area Factor",null,null,null,null,"PA-190",1.05]
[null,null,null,null,null,"AL","AZ",null,"GA-303",0.95,null,null,null,null,"PA-191",1.05]
[null,"OK",0.8,null,null,"AR","IA",null,"GA-311",0.95,null,null,null,null,"PA-192",1.05]
[null,null,null,null,null,"GA","MI",null,"GA-399",0.95,null,null,null,null,"PA-150",0.9]
[null,null,"Coinsurance",null,null,"IL","NC",null,"GA-300",0.85,null,null,null,null,"PA-151",0.9]
[null,null,0.5,null,null,"LA","NE",null,"GA-301",0.85,null,null,null,null,"PA-152",0.9]
[null,null,0.75,null,null,"MO","PA",null,"GA-302",0.85,null,null,null,null,"PA-153",0.9]
[null,null,null,null,null,"MS","SC",null,"GA-305",0.85,null,null,null,null,"PA-154",0.9]
["Deductible","Coinsurance","Coinsurance Factor",null,null,"OH","UT",null,"GA-306",0.85,null,null,null,null,"PA-180",0.9]
[1000,0.5,0.83,null,null,"OK","WI",null,"GA",0.75,null,null,null,null,"PA-181",0.9]
{"$rows_left_out":56}