{"text_format":"1","workbook":"xlsx","n_sheets":8,"sheets":["League Positions","Div 1","Div 2","Div 3","Div 4","Cups","WinnerLossers","Cum results"],"not_rendered":{"charts":0,"images":0,"macros":1,"external_links":0,"defined_names":0,"comments":0,"pivot_tables":0},"unopened":[],"bounds":{"document_bytes":16777216,"sheet_cells":100000,"rows_first":2000,"rows_last":500,"rows_between":2000,"halvings":0,"cell_chars":16384,"cell_head_chars":4096},"cells_cut":0,"cells_raw":0,"read":"whole","date_system":"1900"}

{"sheet":"League Positions","index":0,"n_rows":45,"n_cols":10,"rows_kept":45,"cut":false,"hidden":false,"merged":[[0,1,0,9],[2,2,2,4],[44,2,44,4],[14,2,14,4],[25,2,25,4],[37,2,37,4],[12,2,12,4],[24,2,24,4],[35,2,35,4],[13,1,13,9],[36,1,36,9]]}
[null,"C&D League results for Season 2026"]
[]
[]
[null,"Division 1","Played","Won","Draws","Lost","  Shots   For","Shots Against"," Shots  Dif.","Points"]
[null,{"$f":"'Div 1'!B39","v":"Danbury A"},{"$f":"'Div 1'!C39","v":1},{"$f":"'Div 1'!D39","v":1},{"$f":"'Div 1'!E39","v":0},{"$f":"'Div 1'!F39","v":0},{"$f":"'Div 1'!G39","v":60},{"$f":"'Div 1'!H39","v":38},{"$f":"'Div 1'!I39","v":22},{"$f":"'Div 1'!J39","v":8}]
[null,{"$f":"'Div 1'!B40","v":"Gt_Baddow A"},{"$f":"'Div 1'!C40","v":1},{"$f":"'Div 1'!D40","v":1},{"$f":"'Div 1'!E40","v":0},{"$f":"'Div 1'!F40","v":0},{"$f":"'Div 1'!G40","v":50},{"$f":"'Div 1'!H40","v":45},{"$f":"'Div 1'!I40","v":5},{"$f":"'Div 1'!J40","v":8}]
[null,{"$f":"'Div 1'!B37","v":"Burnham A"},{"$f":"'Div 1'!C37","v":1},{"$f":"'Div 1'!D37","v":1},{"$f":"'Div 1'!E37","v":0},{"$f":"'Div 1'!F37","v":0},{"$f":"'Div 1'!G37","v":46},{"$f":"'Div 1'!H37","v":44},{"$f":"'Div 1'!I37","v":2},{"$f":"'Div 1'!J37","v":8}]
[null,{"$f":"'Div 1'!B41","v":"Maldon A"},{"$f":"'Div 1'!C41","v":1},{"$f":"'Div 1'!D41","v":1},{"$f":"'Div 1'!E41","v":0},{"$f":"'Div 1'!F41","v":0},{"$f":"'Div 1'!G41","v":52},{"$f":"'Div 1'!H41","v":51},{"$f":"'Div 1'!I41","v":1},{"$f":"'Div 1'!J41","v":8}]
[null,{"$f":"'Div 1'!B44","v":"Writtle A"},{"$f":"'Div 1'!C44","v":1},{"$f":"'Div 1'!D44","v":0},{"$f":"'Div 1'!E44","v":0},{"$f":"'Div 1'!F44","v":1},{"$f":"'Div 1'!G44","v":51},{"$f":"'Div 1'!H44","v":52},{"$f":"'Div 1'!I44","v":-1},{"$f":"'Div 1'!J44","v":2}]
[null,{"$f":"'Div 1'!B42","v":"Southminster"},{"$f":"'Div 1'!C42","v":1},{"$f":"'Div 1'!D42","v":0},{"$f":"'Div 1'!E42","v":0},{"$f":"'Div 1'!F42","v":1},{"$f":"'Div 1'!G42","v":44},{"$f":"'Div 1'!H42","v":46},{"$f":"'Div 1'!I42","v":-2},{"$f":"'Div 1'!J42","v":2}]
[null,{"$f":"'Div 1'!B38","v":"Chelmsford A"},{"$f":"'Div 1'!C38","v":1},{"$f":"'Div 1'!D38","v":0},{"$f":"'Div 1'!E38","v":0},{"$f":"'Div 1'!F38","v":1},{"$f":"'Div 1'!G38","v":45},{"$f":"'Div 1'!H38","v":50},{"$f":"'Div 1'!I38","v":-5},{"$f":"'Div 1'!J38","v":2}]
[null,{"$f":"'Div 1'!B43","v":"Stock A"},{"$f":"'Div 1'!C43","v":1},{"$f":"'Div 1'!D43","v":0},{"$f":"'Div 1'!E43","v":0},{"$f":"'Div 1'!F43","v":1},{"$f":"'Div 1'!G43","v":38},{"$f":"'Div 1'!H43","v":60},{"$f":"'Div 1'!I43","v":-22},{"$f":"'Div 1'!J43","v":2}]
[null,null,"Results upto and including",null,null,{"$f":"'Div 1'!Z17","v":"2026-05-06"},null,{"$f":"'Div 1'!AB17","v":""}]
[]
[]
[null,"Division 2","Played","Won","Draws","Lost","  Shots   For","Shots Against"," Shots  Dif.","Points"]
[null,{"$f":"'Div 2'!B38","v":"Lionmede"},{"$f":"'Div 2'!C38","v":1},{"$f":"'Div 2'!D38","v":1},{"$f":"'Div 2'!E38","v":0},{"$f":"'Div 2'!F38","v":0},{"$f":"'Div 2'!G38","v":57},{"$f":"'Div 2'!H38","v":44},{"$f":"'Div 2'!I38","v":13},{"$f":"'Div 2'!J38","v":8}]
[null,{"$f":"'Div 2'!B37","v":"Falcon A"},{"$f":"'Div 2'!C37","v":1},{"$f":"'Div 2'!D37","v":1},{"$f":"'Div 2'!E37","v":0},{"$f":"'Div 2'!F37","v":0},{"$f":"'Div 2'!G37","v":56},{"$f":"'Div 2'!H37","v":50},{"$f":"'Div 2'!I37","v":6},{"$f":"'Div 2'!J37","v":8}]
[null,{"$f":"'Div 2'!B42","v":"SWF"},{"$f":"'Div 2'!C42","v":1},{"$f":"'Div 2'!D42","v":1},{"$f":"'Div 2'!E42","v":0},{"$f":"'Div 2'!F42","v":0},{"$f":"'Div 2'!G42","v":52},{"$f":"'Div 2'!H42","v":48},{"$f":"'Div 2'!I42","v":4},{"$f":"'Div 2'!J42","v":6}]
[null,{"$f":"'Div 2'!B41","v":"Stock B"},{"$f":"'Div 2'!C41","v":1},{"$f":"'Div 2'!D41","v":1},{"$f":"'Div 2'!E41","v":0},{"$f":"'Div 2'!F41","v":0},{"$f":"'Div 2'!G41","v":43},{"$f":"'Div 2'!H41","v":42},{"$f":"'Div 2'!I41","v":1},{"$f":"'Div 2'!J41","v":6}]
[null,{"$f":"'Div 2'!B44","v":"Writtle B"},{"$f":"'Div 2'!C44","v":1},{"$f":"'Div 2'!D44","v":0},{"$f":"'Div 2'!E44","v":0},{"$f":"'Div 2'!F44","v":1},{"$f":"'Div 2'!G44","v":42},{"$f":"'Div 2'!H44","v":43},{"$f":"'Div 2'!I44","v":-1},{"$f":"'Div 2'!J44","v":4}]
[null,{"$f":"'Div 2'!B43","v":"Tillingham"},{"$f":"'Div 2'!C43","v":1},{"$f":"'Div 2'!D43","v":0},{"$f":"'Div 2'!E43","v":0},{"$f":"'Div 2'!F43","v":1},{"$f":"'Div 2'!G43","v":48},{"$f":"'Div 2'!H43","v":52},{"$f":"'Div 2'!I43","v":-4},{"$f":"'Div 2'!J43","v":4}]
[null,{"$f":"'Div 2'!B40","v":"RHP A"},{"$f":"'Div 2'!C40","v":1},{"$f":"'Div 2'!D40","v":0},{"$f":"'Div 2'!E40","v":0},{"$f":"'Div 2'!F40","v":1},{"$f":"'Div 2'!G40","v":50},{"$f":"'Div 2'!H40","v":56},{"$f":"'Div 2'!I40","v":-6},{"$f":"'Div 2'!J40","v":2}]
[null,{"$f":"'Div 2'!B39","v":"Maldon B"},{"$f":"'Div 2'!C39","v":1},{"$f":"'Div 2'!D39","v":0},{"$f":"'Div 2'!E39","v":0},{"$f":"'Div 2'!F39","v":1},{"$f":"'Div 2'!G39","v":44},{"$f":"'Div 2'!H39","v":57},{"$f":"'Div 2'!I39","v":-13},{"$f":"'Div 2'!J39","v":2}]
[null,null,"Results upto and including",null,null,{"$f":"'Div 2'!Z17","v":"2026-05-06"},null,{"$f":"'Div 2'!AB17","v":""}]
[]
[null,"Division 3","Played","Won","Draws","Lost","  Shots   For","Shots Against"," Shots  Dif.","Points"]
[null,{"$f":"'Div 3'!B44","v":"PML"},{"$f":"'Div 3'!C44","v":1},{"$f":"'Div 3'!D44","v":1},{"$f":"'Div 3'!E44","v":0},{"$f":"'Div 3'!F44","v":7},{"$f":"'Div 3'!G44","v":69},{"$f":"'Div 3'!H44","v":36},{"$f":"'Div 3'!I44","v":33},{"$f":"'Div 3'!J44","v":8}]
[null,{"$f":"'Div 3'!B43","v":"Maldon C"},{"$f":"'Div 3'!C43","v":1},{"$f":"'Div 3'!D43","v":1},{"$f":"'Div 3'!E43","v":0},{"$f":"'Div 3'!F43","v":7},{"$f":"'Div 3'!G43","v":58},{"$f":"'Div 3'!H43","v":43},{"$f":"'Div 3'!I43","v":15},{"$f":"'Div 3'!J43","v":8}]
[null,{"$f":"'Div 3'!B42","v":"Ingatestone"},{"$f":"'Div 3'!C42","v":1},{"$f":"'Div 3'!D42","v":1},{"$f":"'Div 3'!E42","v":0},{"$f":"'Div 3'!F42","v":7},{"$f":"'Div 3'!G42","v":49},{"$f":"'Div 3'!H42","v":36},{"$f":"'Div 3'!I42","v":13},{"$f":"'Div 3'!J42","v":6}]
[null,{"$f":"'Div 3'!B41","v":"Gt_Baddow B"},{"$f":"'Div 3'!C41","v":1},{"$f":"'Div 3'!D41","v":1},{"$f":"'Div 3'!E41","v":0},{"$f":"'Div 3'!F41","v":7},{"$f":"'Div 3'!G41","v":52},{"$f":"'Div 3'!H41","v":49},{"$f":"'Div 3'!I41","v":3},{"$f":"'Div 3'!J41","v":6}]
[null,{"$f":"'Div 3'!B38","v":"Chelmsford B"},{"$f":"'Div 3'!C38","v":1},{"$f":"'Div 3'!D38","v":0},{"$f":"'Div 3'!E38","v":0},{"$f":"'Div 3'!F38","v":8},{"$f":"'Div 3'!G38","v":49},{"$f":"'Div 3'!H38","v":52},{"$f":"'Div 3'!I38","v":-3},{"$f":"'Div 3'!J38","v":4}]
[null,{"$f":"'Div 3'!B37","v":"Billericay"},{"$f":"'Div 3'!C37","v":1},{"$f":"'Div 3'!D37","v":0},{"$f":"'Div 3'!E37","v":0},{"$f":"'Div 3'!F37","v":8},{"$f":"'Div 3'!G37","v":36},{"$f":"'Div 3'!H37","v":49},{"$f":"'Div 3'!I37","v":-13},{"$f":"'Div 3'!J37","v":4}]
[null,{"$f":"'Div 3'!B40","v":"Falcon B"},{"$f":"'Div 3'!C40","v":1},{"$f":"'Div 3'!D40","v":0},{"$f":"'Div 3'!E40","v":0},{"$f":"'Div 3'!F40","v":8},{"$f":"'Div 3'!G40","v":43},{"$f":"'Div 3'!H40","v":58},{"$f":"'Div 3'!I40","v":-15},{"$f":"'Div 3'!J40","v":2}]
[null,{"$f":"'Div 3'!B39","v":"Danbury B"},{"$f":"'Div 3'!C39","v":1},{"$f":"'Div 3'!D39","v":0},{"$f":"'Div 3'!E39","v":0},{"$f":"'Div 3'!F39","v":8},{"$f":"'Div 3'!G39","v":36},{"$f":"'Div 3'!H39","v":69},{"$f":"'Div 3'!I39","v":-33},{"$f":"'Div 3'!J39","v":2}]
[null,null,"Results upto and including",null,null,{"$f":"'Div 3'!Z17","v":"2026-05-06"},null,{"$f":"'Div 3'!AB18","v":""}]
[]
[]
[null,"Division 4","Played","Won","Draws","Lost","  Shots   For","Shots Against"," Shots  Dif.","Points"]
[null,{"$f":"'Div 4'!B34","v":"Gt_Baddow C"},{"$f":"'Div 4'!C34","v":0},{"$f":"'Div 4'!D34","v":0},{"$f":"'Div 4'!E34","v":0},{"$f":"'Div 4'!F34","v":0},{"$f":"'Div 4'!G34","v":0},{"$f":"'Div 4'!H34","v":0},{"$f":"'Div 4'!I34","v":0},{"$f":"'Div 4'!J34","v":0}]
[null,{"$f":"'Div 4'!B32","v":"Burnham B"},{"$f":"'Div 4'!C32","v":0},{"$f":"'Div 4'!D32","v":0},{"$f":"'Div 4'!E32","v":0},{"$f":"'Div 4'!F32","v":0},{"$f":"'Div 4'!G32","v":0},{"$f":"'Div 4'!H32","v":0},{"$f":"'Div 4'!I32","v":0},{"$f":"'Div 4'!J32","v":0}]
[null,{"$f":"'Div 4'!B33","v":"Falcon C"},{"$f":"'Div 4'!C33","v":0},{"$f":"'Div 4'!D33","v":0},{"$f":"'Div 4'!E33","v":0},{"$f":"'Div 4'!F33","v":0},{"$f":"'Div 4'!G33","v":0},{"$f":"'Div 4'!H33","v":0},{"$f":"'Div 4'!I33","v":0},{"$f":"'Div 4'!J33","v":0}]
[null,{"$f":"'Div 4'!B35","v":"Stock C"},{"$f":"'Div 4'!C35","v":0},{"$f":"'Div 4'!D35","v":0},{"$f":"'Div 4'!E35","v":0},{"$f":"'Div 4'!F35","v":0},{"$f":"'Div 4'!G35","v":0},{"$f":"'Div 4'!H35","v":0},{"$f":"'Div 4'!I35","v":0},{"$f":"'Div 4'!J35","v":0}]
[null,{"$f":"'Div 4'!B36","v":"Writtle C"},{"$f":"'Div 4'!C36","v":0},{"$f":"'Div 4'!D36","v":0},{"$f":"'Div 4'!E36","v":0},{"$f":"'Div 4'!F36","v":0},{"$f":"'Div 4'!G36","v":0},{"$f":"'Div 4'!H36","v":0},{"$f":"'Div 4'!I36","v":0},{"$f":"'Div 4'!J36","v":0}]
[null,null,"Results upto and including",null,null,{"$f":"'Div 4'!Z13","v":{"$error":"#N/A"}},null,{"$f":"'Div 4'!AB14","v":""}]

{"sheet":"Div 1","index":1,"n_rows":44,"n_cols":32,"rows_kept":44,"cut":false,"hidden":false,"merged":[[20,29,23,30],[3,17,3,19],[15,5,15,6],[19,20,19,22],[15,2,15,3],[19,2,19,4],[19,5,19,7],[19,8,19,10],[19,11,19,13],[19,14,19,16],[19,17,19,19],[15,8,15,9],[15,11,15,12],[15,14,15,15],[15,17,15,18],[15,20,15,21],[2,14,2,16],[2,17,2,19],[2,20,2,22],[3,20,3,22],[18,2,18,4],[18,5,18,7],[18,8,18,10],[18,11,18,13],[18,14,18,16],[18,17,18,19],[18,20,18,22],[3,2,3,4],[3,5,3,7],[3,8,3,10],[3,11,3,13],[3,14,3,16],[0,23,1,23],[31,17,31,18],[31,20,31,21],[34,2,34,9],[34,11,34,16],[34,18,34,23],[31,2,31,3],[31,5,31,6],[31,8,31,9],[31,11,31,12],[31,14,31,15],[0,1,0,22],[2,2,2,4],[2,5,2,7],[2,8,2,10],[2,11,2,13]]}
[null,"Division 1   2026"]
[]
[null,null,{"$f":"Z3","v":"2026-05-06"},null,null,{"$f":"Z4","v":"2026-05-13"},null,null,{"$f":"Z5","v":"2026-05-20"},null,null,{"$f":"Z6","v":"2026-05-27"},null,null,{"$f":"Z7","v":"2026-06-03"},null,null,{"$f":"Z8","v":"2026-06-10"},null,null,{"$f":"Z9","v":"2026-06-17"},null,null,null,1,"2026-05-06",{"$f":"IF(SUM(C6:C13)>0,1,0)","v":1},{"$f":"IF(E16=\"error\",1,0)","v":0},null,null,1,"2026-05-06"]
[null,null,"Week 1",null,null,"Week 2",null,null,"Week 3",null,null,"Week 4",null,null,"Week 5",null,null,"Week 6",null,null,"Week 7",null,null,null,2,{"$f":"Z3+7","v":"2026-05-13"},{"$f":"IF(SUM(F6:F13)>0,1,0)","v":0},{"$f":"IF(H16=\"error\",1,0)","v":0},null,null,1,{"$f":"AF3+7","v":"2026-05-13"}]
[null,null,"For","Against","Points","For","Against","Points","For","Against","Points","For","Against","Points","For","Against","Points","For","Against","Points","For","Against","Points",null,3,{"$f":"Z4+7","v":"2026-05-20"},{"$f":"IF(SUM(I6:I13)>0,1,0)","v":0},{"$f":"IF(K16=\"error\",1,0)","v":0},null,null,1,{"$f":"AF4+7","v":"2026-05-20"}]
["A","Burnham A",46,44,8,null,null,null,null,null,null,null,null,null,null,null,null,null,null,null,null,null,null,null,4,"2026-05-27",{"$f":"IF(SUM(L6:L13)>0,1,0)","v":0},{"$f":"IF(N16=\"error\",1,0)","v":0},null,null,0,"2026-05-27"]
["B","Chelmsford A",45,50,2,null,null,null,null,null,null,null,null,null,null,null,null,null,null,null,null,null,null,null,5,"2026-06-03",{"$f":"IF(SUM(O6:O13)>0,1,0)","v":0},{"$f":"IF(Q16=\"error\",1,0)","v":0},null,null,1,"2026-06-03"]
["C","Danbury A",60,38,8,null,null,null,null,null,null,null,null,null,null,null,null,null,null,null,null,null,null,null,6,"2026-06-10",{"$f":"IF(SUM(R6:R13)>0,1,0)","v":0},{"$f":"IF(T16=\"error\",1,0)","v":0},null,null,0,"2026-06-10"]
["D","Gt_Baddow A",50,45,8,null,null,null,null,null,null,null,null,null,null,null,null,null,null,null,null,null,null,null,7,"2026-06-17",{"$f":"IF(SUM(U6:U13)>0,1,0)","v":0},{"$f":"IF(W16=\"error\",1,0)","v":0},null,null,0,"2026-06-17"]
["E","Maldon A",52,51,8,null,null,null,null,null,null,null,null,null,null,null,null,null,null,null,null,null,null,null,8,{"$f":"Z9+14","v":"2026-07-01"},{"$f":"IF(SUM(C22:C29)>0,1,0)","v":0},{"$f":"IF(E32=\"error\",1,0)","v":0},null,null,0,{"$f":"AF9+14","v":"2026-07-01"}]
["F","Southminster",44,46,2,null,null,null,null,null,null,null,null,null,null,null,null,null,null,null,null,null,null,null,9,"2026-07-08",{"$f":"IF(SUM(F22:F29)>0,1,0)","v":0},{"$f":"IF(H32=\"error\",1,0)","v":0},null,null,0,"2026-07-08"]
["G","Stock A",38,60,2,null,null,null,null,null,null,null,null,null,null,null,null,null,null,null,null,null,null,null,10,"2026-07-15",{"$f":"IF(SUM(I22:I29)>0,1,0)","v":0},{"$f":"IF(K32=\"error\",1,0)","v":0},null,null,0,"2026-07-15"]
["H","Writtle A",51,52,2,null,null,null,null,null,null,null,null,null,null,null,null,null,null,null,null,null,null,null,11,"2026-07-22",{"$f":"IF(SUM(L22:L29)>0,1,0)","v":0},{"$f":"IF(N32=\"error\",1,0)","v":0},null,null,0,"2026-07-22"]
[null,null,null,null,null,null,null,null,null,null,null,null,null,null,null,null,null,null,null,null,null,null,null,null,12,"2026-07-29",{"$f":"IF(SUM(O22:O29)>0,1,0)","v":0},{"$f":"IF(Q32=\"error\",1,0)","v":0},null,null,0,"2026-07-29"]
[null,null,{"$f":"SUM(C6:C13)","v":386},{"$f":"SUM(D6:D13)","v":386},{"$f":"SUM(E6:E13)","v":40},{"$f":"SUM(F6:F13)","v":0},{"$f":"SUM(G6:G13)","v":0},0,0,{"$f":"SUM(J6:J13)","v":0},{"$f":"SUM(K6:K13)","v":0},0,{"$f":"SUM(M6:M13)","v":0},{"$f":"SUM(N6:N13)","v":0},0,{"$f":"SUM(P6:P13)","v":0},{"$f":"SUM(Q6:Q13)","v":0},0,{"$f":"SUM(S6:S13)","v":0},{"$f":"SUM(T6:T13)","v":0},0,{"$f":"SUM(V6:V13)","v":0},{"$f":"SUM(W6:W13)","v":0},null,13,{"$f":"Z14+7","v":"2026-08-05"},{"$f":"IF(SUM(R22:R29)>0,1,0)","v":0},{"$f":"IF(T32=\"error\",1,0)","v":0},null,null,0,{"$f":"AF14+7","v":"2026-08-05"}]
[null,null,{"$f":"IF(C15<>D15,\"error\",IF(SUM(C6:C13)+SUM(D6:D13)=0,\"\",\"correct\"))","v":"correct"},null,{"$f":"IF(E15=0,\"\",IF(E15=40,\"correct\",\"error\"))","v":"correct"},{"$f":"IF(F15<>G15,\"error\",IF(SUM(F6:F13)+SUM(G6:G13)=0,\"\",\"correct\"))","v":""},null,{"$f":"IF(H15=0,\"\",IF(H15=40,\"correct\",\"error\"))","v":""},{"$f":"IF(I15<>J15,\"error\",IF(SUM(I6:I13)+SUM(J6:J13)=0,\"\",\"correct\"))","v":""},null,{"$f":"IF(K15=0,\"\",IF(K15=40,\"correct\",\"error\"))","v":""},{"$f":"IF(L15<>M15,\"error\",IF(SUM(L6:L13)+SUM(M6:M13)=0,\"\",\"correct\"))","v":""},null,{"$f":"IF(N15=0,\"\",IF(N15=40,\"correct\",\"error\"))","v":""},{"$f":"IF(O15<>P15,\"error\",IF(SUM(O6:O13)+SUM(P6:P13)=0,\"\",\"correct\"))","v":""},null,{"$f":"IF(Q15=0,\"\",IF(Q15=40,\"correct\",\"error\"))","v":""},{"$f":"IF(R15<>S15,\"error\",IF(SUM(R6:R13)+SUM(S6:S13)=0,\"\",\"correct\"))","v":""},null,{"$f":"IF(T15=0,\"\",IF(T15=40,\"correct\",\"error\"))","v":""},{"$f":"IF(U15<>V15,\"error\",IF(SUM(U6:U13)+SUM(V6:V13)=0,\"\",\"correct\"))","v":""},null,{"$f":"IF(W15=0,\"\",IF(W15=40,\"correct\",\"error\"))","v":""},null,14,"2026-08-12",{"$f":"IF(SUM(U22:U29)>0,1,0)","v":0},{"$f":"IF(W32=\"error\",1,0)","v":0},null,null,0,"2026-08-12"]
[null,null,null,null,{"$f":"IF(E16=\"\",\"\",IF(E15/10-INT(E15/10)=0,\"correct\",\"error\"))","v":"correct"},null,null,{"$f":"IF(H16=\"\",\"\",IF(H15/10-INT(H15/10)=0,\"correct\",\"Error\"))","v":""},null,null,{"$f":"IF(K16=\"\",\"\",IF(K15/10-INT(K15/10)=0,\"correct\",\"error\"))","v":""},null,null,{"$f":"IF(N16=\"\",\"\",IF(N15/10-INT(N15/10)=0,\"correct\",\"error\"))","v":""},null,null,{"$f":"IF(Q16=\"\",\"\",IF(Q15/10-INT(Q15/10)=0,\"correct\",\"error\"))","v":""},null,null,{"$f":"IF(T16=\"\",\"\",IF(T15/10-INT(T15/10)=0,\"correct\",\"error\"))","v":""},null,null,{"$f":"IF(W16=\"\",\"\",IF(W15/10-INT(W15/10)=0,\"correct\",\"error\"))","v":""},null,null,{"$f":"VLOOKUP(MATCH(0,AA3:AA16,0)-1,Y3:Z16,2)","v":"2026-05-06"},{"$f":"SUM(AA3:AA16)","v":1},{"$f":"IF(SUM(AB3:AB16)>0,\"Awaiting some results\",\"\")","v":""}]
[]
[null,null,{"$f":"Z10","v":"2026-07-01"},null,null,{"$f":"Z11","v":"2026-07-08"},null,null,{"$f":"Z12","v":"2026-07-15"},null,null,{"$f":"Z13","v":"2026-07-22"},null,null,{"$f":"Z14","v":"2026-07-29"},null,null,{"$f":"Z15","v":"2026-08-05"},null,null,{"$f":"Z16","v":"2026-08-12"}]
[null,null,"Week 8",null,null,"Week 9",null,null,"Week 10",null,null,"Week 11",null,null,"Week 12",null,null,"Week 13",null,null,"Week 14"]
[null,null,"For","Against","Points","For","Against","Points","For","Against","Points","For","Against","Points","For","Against","Points","For","Against","Points","For","Against","Points"]
[{"$f":"A6","v":"A"},"Burnham A"]
["B","Chelmsford A"]
["C","Danbury A"]
["D","Gt_Baddow A"]
["E","Maldon A"]
["F","Southminster"]
["G","Stock A"]
["H","Writtle A"]
[]
[null,null,{"$f":"SUM(C22:C29)","v":0},{"$f":"SUM(D22:D29)","v":0},{"$f":"SUM(E22:E29)","v":0},0,0,0,0,0,0,0,0,0,0,0,0,0,0,0,0,0,0]
[null,null,{"$f":"IF(C31<>D31,\"error\",IF(SUM(C22:C29)+SUM(D22:D29)=0,\"\",\"correct\"))","v":""},null,{"$f":"IF(E31=0,\"\",IF(E31=40,\"correct\",\"error\"))","v":""},{"$f":"IF(F31<>G31,\"error\",IF(SUM(F22:F29)+SUM(G22:G29)=0,\"\",\"correct\"))","v":""},null,{"$f":"IF(H31=0,\"\",IF(H31=40,\"correct\",\"error\"))","v":""},{"$f":"IF(I31<>J31,\"error\",IF(SUM(I22:I29)+SUM(J22:J29)=0,\"\",\"correct\"))","v":""},null,{"$f":"IF(K31=0,\"\",IF(K31=40,\"correct\",\"error\"))","v":""},{"$f":"IF(L31<>M31,\"error\",IF(SUM(L22:L29)+SUM(M22:M29)=0,\"\",\"correct\"))","v":""},null,{"$f":"IF(N31=0,\"\",IF(N31=40,\"correct\",\"error\"))","v":""},{"$f":"IF(O31<>P31,\"error\",IF(SUM(O22:O29)+SUM(P22:P29)=0,\"\",\"correct\"))","v":""},null,{"$f":"IF(Q31=0,\"\",IF(Q31=40,\"correct\",\"error\"))","v":""},{"$f":"IF(R31<>S31,\"error\",IF(SUM(R22:R29)+SUM(S22:S29)=0,\"\",\"correct\"))","v":""},null,{"$f":"IF(T31=0,\"\",IF(T31=40,\"correct\",\"error\"))","v":""},{"$f":"IF(U31<>V31,\"error\",IF(SUM(U22:U29)+SUM(V22:V29)=0,\"\",\"correct\"))","v":""},null,{"$f":"IF(W31=0,\"\",IF(W31=40,\"correct\",\"error\"))","v":""}]
[null,null,null,null,{"$f":"IF(E32=\"\",\"\",IF(E31/10-INT(E31/10)=0,\"correct\",\"error\"))","v":""},null,{"$f":"IF(G32=\"\",\"\",IF(G31/10-INT(G31/10)=0,\"Correct\",\"Error\"))","v":""},{"$f":"IF(H32=\"\",\"\",IF(H31/10-INT(H31/10)=0,\"correct\",\"error\"))","v":""},null,"",{"$f":"IF(K32=\"\",\"\",IF(K31/10-INT(K31/10)=0,\"correct\",\"error\"))","v":""},null,"",{"$f":"IF(N32=\"\",\"\",IF(N31/10-INT(N31/10)=0,\"correct\",\"error\"))","v":""},null,"",{"$f":"IF(Q32=\"\",\"\",IF(Q31/10-INT(Q31/10)=0,\"correct\",\"error\"))","v":""},null,"",{"$f":"IF(T32=\"\",\"\",IF(T31/10-INT(T31/10)=0,\"correct\",\"error\"))","v":""},null,"",{"$f":"IF(W32=\"\",\"\",IF(W31/10-INT(W31/10)=0,\"correct\",\"error\"))","v":""}]
[]
[null,null,"Totals for season",null,null,null,null,null,null,null,null,"Resulrs for first half of season",null,null,null,null,null,null,"Resulrs for second half of season"]
[null,null,"Played","Won","Drew","Lost","Shots For","Shot Against","Shot Diff","Points",null,"Won","Drew","Lost","For","Against","Points",null,"Won","Drew","Lost","For","Against","Points"]
[{"$f":"A6","v":"A"},"Burnham A",{"$f":"COUNTA(C6:W6)/3+COUNTA(C22:W22)/3","v":1},{"$f":"L37+S37","v":1},{"$f":"M37+T37","v":0},0,46,44,{"$f":"G37-H37","v":2},{"$f":"Q37+X37","v":8},null,{"$f":"IF(E6>5,1,0)+IF(H6>5,1,0)+IF(K6>5,1,0)+IF(N6>5,1,0)+IF(Q6>5,1,0)+IF(T6>5,1,0)+IF(W6>5,1,0)","v":1},{"$f":"IF(E6=5,1,0)+IF(H6=5,1,0)+IF(K6=5,1,0)+IF(N6=5,1,0)+IF(Q6=5,1,0)+IF(T6=5,1,0)+IF(W6=5,1,0)","v":0},{"$f":"IF(E6=\"\",0,IF(E6<5,1,0))+IF(H6=\"\",0,IF(H6<5,1,0))+IF(K6=\"\",0,IF(K6<5,1,0))+IF(N6=\"\",0,IF(N6<5,1,0))+IF(Q6=\"\",0,IF(Q6<5,1,0))+IF(T6=\"\",0,IF(T6<5,1,0))+IF(W6=\"\",0,IF(W6<5,1,0))","v":0},{"$f":"C6+F6+I6+L6+O6+R6+U6","v":46},44,8,null,{"$f":"IF(E22>5,1,0)+IF(H22>5,1,0)+IF(K22>5,1,0)+IF(N22>5,1,0)+IF(Q22>5,1,0)+IF(T22>5,1,0)+IF(W22>5,1,0)","v":0},{"$f":"IF(E22=5,1,0)+IF(H22=5,1,0)+IF(K22=5,1,0)+IF(N22=5,1,0)+IF(Q22=5,1,0)+IF(T22=5,1,0)+IF(W22=5,1,0)","v":0},{"$f":"IF(E22=\"\",0,IF(E22<5,1,0))+IF(H22=\"\",0,IF(H22<5,1,0))+IF(K22=\"\",0,IF(K22<5,1,0))+IF(N22=\"\",0,IF(N22<5,1,0))+IF(Q22=\"\",0,IF(Q22<5,1,0))+IF(T22=\"\",0,IF(T22<5,1,0))+IF(W22=\"\",0,IF(W22<5,1,0))","v":0},{"$f":"C22+F22+I22+L22+O22+R22+U22","v":0},{"$f":"D22+G22+J22+M22+P22+S22+V22","v":0},{"$f":"E22+H22+K22+N22+Q22+T22+W22","v":0}]
["B","Chelmsford A",1,{"$f":"L38+S38","v":0},{"$f":"M38+T38","v":0},{"$f":"N38+U38","v":1},{"$f":"O38+V38","v":45},{"$f":"P38+W38","v":50},{"$f":"G38-H38","v":-5},{"$f":"Q38+X38","v":2},null,0,0,1,45,50,2,null,{"$f":"IF(E23>5,1,0)+IF(H23>5,1,0)+IF(K23>5,1,0)+IF(N23>5,1,0)+IF(Q23>5,1,0)+IF(T23>5,1,0)+IF(W23>5,1,0)","v":0},{"$f":"IF(E23=5,1,0)+IF(H23=5,1,0)+IF(K23=5,1,0)+IF(N23=5,1,0)+IF(Q23=5,1,0)+IF(T23=5,1,0)+IF(W23=5,1,0)","v":0},{"$f":"IF(E23=\"\",0,IF(E23<5,1,0))+IF(H23=\"\",0,IF(H23<5,1,0))+IF(K23=\"\",0,IF(K23<5,1,0))+IF(N23=\"\",0,IF(N23<5,1,0))+IF(Q23=\"\",0,IF(Q23<5,1,0))+IF(T23=\"\",0,IF(T23<5,1,0))+IF(W23=\"\",0,IF(W23<5,1,0))","v":0},{"$f":"C23+F23+I23+L23+O23+R23+U23","v":0},0,0]
["C","Danbury A",1,1,0,0,60,38,22,8,null,1,0,0,60,38,8,null,0,0,0,{"$f":"C24+F24+I24+L24+O24+R24+U24","v":0},0,0]
["D","Gt_Baddow A",1,1,0,0,50,45,5,8,null,1,0,0,50,45,8,null,0,0,0,{"$f":"C25+F25+I25+L25+O25+R25+U25","v":0},0,0]
["E","Maldon A",1,1,0,0,52,51,1,8,null,1,0,0,52,51,8,null,0,0,0,{"$f":"C26+F26+I26+L26+O26+R26+U26","v":0},0,0]
["F","Southminster",1,0,0,1,44,46,-2,2,null,0,0,1,44,46,2,null,0,0,0,{"$f":"C27+F27+I27+L27+O27+R27+U27","v":0},0,0]
["G","Stock A",1,0,0,1,38,60,-22,2,null,0,0,1,38,60,2,null,0,0,0,{"$f":"C28+F28+I28+L28+O28+R28+U28","v":0},0,0]
["H","Writtle A",1,0,0,1,51,52,-1,2,null,0,0,1,51,52,2,null,0,0,0,{"$f":"C29+F29+I29+L29+O29+R29+U29","v":0},0,0]

{"sheet":"Div 2","index":2,"n_rows":44,"n_cols":28,"rows_kept":44,"cut":false,"hidden":false,"merged":[[2,17,2,19],[0,1,0,22],[18,2,18,4],[18,5,18,7],[18,8,18,10],[18,11,18,13],[18,14,18,16],[18,17,18,19],[18,20,18,22],[3,20,3,22],[3,2,3,4],[3,5,3,7],[3,8,3,10],[3,11,3,13],[3,14,3,16],[19,11,19,13],[19,14,19,16],[2,20,2,22],[15,2,15,3],[15,5,15,6],[15,8,15,9],[15,11,15,12],[15,14,15,15],[15,17,15,18],[15,20,15,21],[3,17,3,19],[2,2,2,4],[2,5,2,7],[2,8,2,10],[2,11,2,13],[2,14,2,16],[0,23,1,23],[34,2,34,9],[34,11,34,16],[34,18,34,23],[19,17,19,19],[19,20,19,22],[31,2,31,3],[31,5,31,6],[31,8,31,9],[31,11,31,12],[31,14,31,15],[31,17,31,18],[31,20,31,21],[19,2,19,4],[19,5,19,7],[19,8,19,10]]}
[null,"Division 2   2026",null,null,null,null,null,null,null,null,null,null,null,null,null,null,null,null,null,null,null,null,null,null,40]
[]
[null,null,{"$f":"Z3","v":"2026-05-06"},null,null,{"$f":"'Div 1'!F3:H3","v":"2026-05-13"},null,null,{"$f":"'Div 1'!I3:K3","v":"2026-05-20"},null,null,{"$f":"'Div 1'!L3:N3","v":"2026-05-27"},null,null,{"$f":"'Div 1'!O3:Q3","v":"2026-06-03"},null,null,{"$f":"'Div 1'!R3:T3","v":"2026-06-10"},null,null,{"$f":"'Div 1'!U3:W3","v":"2026-06-17"},null,null,null,1,"2026-05-06",{"$f":"IF(SUM(C6:C13)>0,1,0)","v":1},{"$f":"IF(E16=\"error\",1,0)","v":0}]
[null,null,"Week 1",null,null,"Week 2",null,null,"Week 3",null,null,"Week 4",null,null,"Week 5",null,null,"Week 6",null,null,"Week 7",null,null,null,2,{"$f":"Z3+7","v":"2026-05-13"},{"$f":"IF(SUM(F6:F13)>0,1,0)","v":0},{"$f":"IF(H16=\"error\",1,0)","v":0}]
[null,null,"For","Against","Points","For","Against","Points","For","Against","Points","For","Against","Points","For","Against","Points","For","Against","Points","For","Against","Points",null,3,{"$f":"Z4+7","v":"2026-05-20"},{"$f":"IF(SUM(I6:I13)>0,1,0)","v":0},{"$f":"IF(K16=\"error\",1,0)","v":0}]
["A","Falcon A",56,50,8,null,null,null,null,null,null,null,null,null,null,null,null,null,null,null,null,null,null,null,4,"2026-05-27",{"$f":"IF(SUM(L6:L13)>0,1,0)","v":0},{"$f":"IF(N16=\"error\",1,0)","v":0}]
["B","Lionmede",57,44,8,null,null,null,null,null,null,null,null,null,null,null,null,null,null,null,null,null,null,null,5,"2026-06-03",{"$f":"IF(SUM(O6:O13)>0,1,0)","v":0},{"$f":"IF(Q16=\"error\",1,0)","v":0}]
["C","Maldon B",44,57,2,null,null,null,null,null,null,null,null,null,null,null,null,null,null,null,null,null,null,null,6,"2026-06-10",{"$f":"IF(SUM(R6:R13)>0,1,0)","v":0},{"$f":"IF(T16=\"error\",1,0)","v":0}]
["D","RHP A",50,56,2,null,null,null,null,null,null,null,null,null,null,null,null,null,null,null,null,null,null,null,7,"2026-06-17",{"$f":"IF(SUM(U6:U13)>0,1,0)","v":0},{"$f":"IF(W16=\"error\",1,0)","v":0}]
["E","Stock B",43,42,6,null,null,null,null,null,null,null,null,null,null,null,null,null,null,null,null,null,null,null,8,{"$f":"Z9+14","v":"2026-07-01"},{"$f":"IF(SUM(C22:C29)>0,1,0)","v":0},{"$f":"IF(E32=\"error\",1,0)","v":0}]
["F","SWF",52,48,6,null,null,null,null,null,null,null,null,null,null,null,null,null,null,null,null,null,null,null,9,"2026-07-08",{"$f":"IF(SUM(F22:F29)>0,1,0)","v":0},{"$f":"IF(H32=\"error\",1,0)","v":0}]
["G","Tillingham",48,52,4,null,null,null,null,null,null,null,null,null,null,null,null,null,null,null,null,null,null," ",10,"2026-07-15",{"$f":"IF(SUM(I22:I29)>0,1,0)","v":0},{"$f":"IF(K32=\"error\",1,0)","v":0}]
["H","Writtle B",42,43,4,null,null,null,null,null,null,null,null,null,null,null,null,null,null,null,null,null,null,null,11,"2026-07-22",{"$f":"IF(SUM(L22:L29)>0,1,0)","v":0},{"$f":"IF(N32=\"error\",1,0)","v":0}]
[null,null,null,null,null,null,null,null,null,null,null,null,null,null,null,null,null,null,null,null,null,null,null,null,12,"2026-07-29",{"$f":"IF(SUM(O22:O29)>0,1,0)","v":0},{"$f":"IF(Q32=\"error\",1,0)","v":0}]
[null,null,{"$f":"SUM(C6:C13)","v":392},{"$f":"SUM(D6:D13)","v":392},{"$f":"SUM(E6:E13)","v":40},{"$f":"SUM(F6:F13)","v":0},{"$f":"SUM(G6:G13)","v":0},0,0,0,0,0,0,0,0,0,0,0,0,0,0,0,0,null,13,{"$f":"Z14+7","v":"2026-08-05"},{"$f":"IF(SUM(R22:R29)>0,1,0)","v":0},{"$f":"IF(T32=\"error\",1,0)","v":0}]
[null,null,{"$f":"IF(C15<>D15,\"error\",IF(SUM(C6:C13)+SUM(D6:D13)=0,\"\",\"correct\"))","v":"correct"},null,{"$f":"IF(E15=0,\"\",IF(E15=Y1,\"correct\",\"error\"))","v":"correct"},{"$f":"IF(F15<>G15,\"error\",IF(SUM(F6:F13)+SUM(G6:G13)=0,\"\",\"correct\"))","v":""},null,{"$f":"IF(H15=0,\"\",IF(H15=Y1,\"correct\",\"error\"))","v":""},{"$f":"IF(I15<>J15,\"error\",IF(SUM(I6:I13)+SUM(J6:J13)=0,\"\",\"correct\"))","v":""},null,{"$f":"IF(K15=0,\"\",IF(K15=Y1,\"correct\",\"error\"))","v":""},{"$f":"IF(L15<>M15,\"error\",IF(SUM(L6:L13)+SUM(M6:M13)=0,\"\",\"correct\"))","v":""},null,{"$f":"IF(N15=0,\"\",IF(N15=Y1,\"correct\",\"error\"))","v":""},{"$f":"IF(O15<>P15,\"error\",IF(SUM(O6:O13)+SUM(P6:P13)=0,\"\",\"correct\"))","v":""},null,{"$f":"IF(Q15=0,\"\",IF(Q15=Y1,\"correct\",\"error\"))","v":""},{"$f":"IF(R15<>S15,\"error\",IF(SUM(R6:R13)+SUM(S6:S13)=0,\"\",\"correct\"))","v":""},null,{"$f":"IF(T15=0,\"\",IF(T15=Y1,\"correct\",\"error\"))","v":""},{"$f":"IF(U15<>V15,\"error\",IF(SUM(U6:U13)+SUM(V6:V13)=0,\"\",\"correct\"))","v":""},null,{"$f":"IF(W15=0,\"\",IF(W15=Y1,\"correct\",\"error\"))","v":""},null,14,"2026-08-12",{"$f":"IF(SUM(U22:U29)>0,1,0)","v":0},{"$f":"IF(W32=\"error\",1,0)","v":0}]
[null,null,null,null,{"$f":"IF(E16=\"\",\"\",IF(E15/10-INT(E15/10)=0,\"correct\",\"error\"))","v":"correct"},null,null,{"$f":"IF(H16=\"\",\"\",IF(H15/10-INT(H15/10)=0,\"correct\",\"error\"))","v":""},null,null,"",null,null,"",null,null,"",null,null,"",null,null,"",null,null,{"$f":"VLOOKUP(MATCH(0,AA3:AA16,0)-1,Y3:Z16,2)","v":"2026-05-06"},{"$f":"SUM(AA3:AA16)","v":1},{"$f":"IF(SUM(AB3:AB16)>0,\"Awaiting some results\",\"\")","v":""}]
[]
[null,null,{"$f":"'Div 1'!C19:E19","v":"2026-07-01"},null,null,{"$f":"'Div 1'!F19:H19","v":"2026-07-08"},null,null,{"$f":"'Div 1'!I19:K19","v":"2026-07-15"},null,null,{"$f":"'Div 1'!L19:N19","v":"2026-07-22"},null,null,{"$f":"'Div 1'!O19:Q19","v":"2026-07-29"},null,null,{"$f":"'Div 1'!R19:T19","v":"2026-08-05"},null,null,{"$f":"'Div 1'!U19:W19","v":"2026-08-12"}]
[null,null,"Week 8",null,null,"Week 9",null,null,"Week 10",null,null,"Week 11",null,null,"Week 12",null,null,"Week 13",null,null,"Week 14"]
[null,null,"For","Against","Points","For","Against","Points","For","Against","Points","For","Against","Points","For","Against","Points","For","Against","Points","For","Against","Points"]
[{"$f":"A6","v":"A"},"Falcon A"]
["B","Lionmede"]
["C","Maldon B"]
["D","RHP A"]
["E","Stock B"]
["F","SWF"]
["G","Tillingham"]
["H","Writtle B"]
[]
[null,null,{"$f":"SUM(C22:C29)","v":0},{"$f":"SUM(D22:D29)","v":0},0,0,0,0,0,0,0,0,0,0,0,0,0,0,0,0,0,0,0]
[null,null,{"$f":"IF(C31<>D31,\"error\",IF(SUM(C22:C29)+SUM(D22:D29)=0,\"\",\"correct\"))","v":""},null,{"$f":"IF(E31=0,\"\",IF(E31=Y1,\"correct\",\"error\"))","v":""},{"$f":"IF(F31<>G31,\"error\",IF(SUM(F22:F29)+SUM(G22:G29)=0,\"\",\"correct\"))","v":""},null,{"$f":"IF(H31=0,\"\",IF(H31=Y1,\"correct\",\"error\"))","v":""},{"$f":"IF(I31<>J31,\"error\",IF(SUM(I22:I29)+SUM(J22:J29)=0,\"\",\"correct\"))","v":""},null,{"$f":"IF(K31=0,\"\",IF(K31=Y1,\"correct\",\"error\"))","v":""},{"$f":"IF(L31<>M31,\"error\",IF(SUM(L22:L29)+SUM(M22:M29)=0,\"\",\"correct\"))","v":""},null,{"$f":"IF(N31=0,\"\",IF(N31=Y1,\"correct\",\"error\"))","v":""},{"$f":"IF(O31<>P31,\"error\",IF(SUM(O22:O29)+SUM(P22:P29)=0,\"\",\"correct\"))","v":""},null,{"$f":"IF(Q31=0,\"\",IF(Q31=Y1,\"correct\",\"error\"))","v":""},{"$f":"IF(R31<>S31,\"error\",IF(SUM(R22:R29)+SUM(S22:S29)=0,\"\",\"correct\"))","v":""},null,{"$f":"IF(T31=0,\"\",IF(T31=Y1,\"correct\",\"error\"))","v":""},{"$f":"IF(U31<>V31,\"error\",IF(SUM(U22:U29)+SUM(V22:V29)=0,\"\",\"correct\"))","v":""},null,{"$f":"IF(W31=0,\"\",IF(W31=Y1,\"correct\",\"error\"))","v":""}]
[null,null,null,null,{"$f":"IF(E31/10-INT(E31/10)=0,\"correct\",\"error\")","v":"correct"},null,null,{"$f":"IF(H31/10-INT(H31/10)=0,\"correct\",\"error\")","v":"correct"},null,null,"correct",null,null,"correct",null,null,"correct",null,null,"correct",null,null,"correct"]
[]
[null,null,"Totals for season",null,null,null,null,null,null,null,null,"Resulrs for first half of season",null,null,null,null,null,null,"Resulrs for second half of season"]
[null,null,"Played","Won","Drew","Lost","Shots For","Shot Against","Shot Diff","Points",null,"Won","Drew","Lost","For","Against","Points",null,"Won","Drew","Lost","For","Against","Points"]
[{"$f":"A6","v":"A"},"Falcon A",{"$f":"COUNTA(C6:W6)/3+COUNTA(C22:W22)/3","v":1},{"$f":"L37+S37","v":1},{"$f":"M37+T37","v":0},0,56,50,{"$f":"G37-H37","v":6},{"$f":"Q37+X37","v":8},null,{"$f":"IF(E6>5,1,0)+IF(H6>5,1,0)+IF(K6>5,1,0)+IF(N6>5,1,0)+IF(Q6>5,1,0)+IF(T6>5,1,0)+IF(W6>5,1,0)","v":1},{"$f":"IF(E6=5,1,0)+IF(H6=5,1,0)+IF(K6=5,1,0)+IF(N6=5,1,0)+IF(Q6=5,1,0)+IF(T6=5,1,0)+IF(W6=5,1,0)","v":0},{"$f":"IF(E6=\"\",0,IF(E6<5,1,0))+IF(H6=\"\",0,IF(H6<5,1,0))+IF(K6=\"\",0,IF(K6<5,1,0))+IF(N6=\"\",0,IF(N6<5,1,0))+IF(Q6=\"\",0,IF(Q6<5,1,0))+IF(T6=\"\",0,IF(T6<5,1,0))+IF(W6=\"\",0,IF(W6<5,1,0))","v":0},{"$f":"C6+F6+I6+L6+O6+R6+U6","v":56},50,8,null,{"$f":"IF(E22>5,1,0)+IF(H22>5,1,0)+IF(K22>5,1,0)+IF(N22>5,1,0)+IF(Q22>5,1,0)+IF(T22>5,1,0)+IF(W22>5,1,0)","v":0},{"$f":"IF(E22=5,1,0)+IF(H22=5,1,0)+IF(K22=5,1,0)+IF(N22=5,1,0)+IF(Q22=5,1,0)+IF(T22=5,1,0)+IF(W22=5,1,0)","v":0},{"$f":"IF(E22=\"\",0,IF(E22<5,1,0))+IF(H22=\"\",0,IF(H22<5,1,0))+IF(K22=\"\",0,IF(K22<5,1,0))+IF(N22=\"\",0,IF(N22<5,1,0))+IF(Q22=\"\",0,IF(Q22<5,1,0))+IF(T22=\"\",0,IF(T22<5,1,0))+IF(W22=\"\",0,IF(W22<5,1,0))","v":0},{"$f":"C22+F22+I22+L22+O22+R22+U22","v":0},{"$f":"D22+G22+J22+M22+P22+S22+V22","v":0},{"$f":"E22+H22+K22+N22+Q22+T22+W22","v":0}]
["B","Lionmede",1,{"$f":"L38+S38","v":1},0,0,57,44,{"$f":"G38-H38","v":13},{"$f":"Q38+X38","v":8},null,1,0,0,57,44,8,null,{"$f":"IF(E23>5,1,0)+IF(H23>5,1,0)+IF(K23>5,1,0)+IF(N23>5,1,0)+IF(Q23>5,1,0)+IF(T23>5,1,0)+IF(W23>5,1,0)","v":0},{"$f":"IF(E23=5,1,0)+IF(H23=5,1,0)+IF(K23=5,1,0)+IF(N23=5,1,0)+IF(Q23=5,1,0)+IF(T23=5,1,0)+IF(W23=5,1,0)","v":0},{"$f":"IF(E23=\"\",0,IF(E23<5,1,0))+IF(H23=\"\",0,IF(H23<5,1,0))+IF(K23=\"\",0,IF(K23<5,1,0))+IF(N23=\"\",0,IF(N23<5,1,0))+IF(Q23=\"\",0,IF(Q23<5,1,0))+IF(T23=\"\",0,IF(T23<5,1,0))+IF(W23=\"\",0,IF(W23<5,1,0))","v":0},{"$f":"C23+F23+I23+L23+O23+R23+U23","v":0},0,0]
["C","Maldon B",1,0,0,1,44,57,-13,2,null,0,0,1,44,57,2,null,0,0,0,0,0,0]
["D","RHP A",1,0,0,1,50,56,-6,2,null,0,0,1,50,56,2,null,0,0,0,0,0,0]
["E","Stock B",1,1,0,0,43,42,1,6,null,1,0,0,43,42,6,null,0,0,0,0,0,0]
["F","SWF",1,1,0,0,52,48,4,6,null,1,0,0,52,48,6,null,0,0,0,0,0,0]
["G","Tillingham",1,0,0,1,48,52,-4,4,null,0,0,1,48,52,4,null,0,0,0,0,0,0]
["H","Writtle B",1,0,0,1,42,43,-1,4,null,0,0,1,42,43,4,null,0,0,0,0,0,0]

{"sheet":"Div 3","index":3,"n_rows":44,"n_cols":28,"rows_kept":44,"cut":false,"hidden":false,"merged":[[18,2,18,4],[19,2,19,4],[18,5,18,7],[19,5,19,7],[18,8,18,10],[18,11,18,13],[19,8,19,10],[19,11,19,13],[3,20,3,22],[15,17,15,18],[15,20,15,21],[15,11,15,12],[15,14,15,15],[19,14,19,16],[19,17,19,19],[19,20,19,22],[18,14,18,16],[18,17,18,19],[18,20,18,22],[15,8,15,9],[2,20,2,22],[2,11,2,13],[3,11,3,13],[2,14,2,16],[2,17,2,19],[3,14,3,16],[3,17,3,19],[3,2,3,4],[3,5,3,7],[2,2,2,4],[2,5,2,7],[3,8,3,10],[2,8,2,10],[0,23,1,23],[0,1,0,22],[34,2,34,9],[34,12,34,17],[34,21,34,26],[31,2,31,3],[31,5,31,6],[31,8,31,9],[31,11,31,12],[31,14,31,15],[31,17,31,18],[31,20,31,21],[31,23,31,24],[31,26,31,27],[15,2,15,3],[15,5,15,6]]}
[null,"Division 3   2026",null,null,null,null,null,null,null,null,null,null,null,null,null,null,null,null,null,null,null,null,null,null,40]
[]
[null,null,{"$f":"Z3","v":"2026-05-06"},null,null,{"$f":"'Div 1'!F3:H3","v":"2026-05-13"},null,null,{"$f":"'Div 1'!I3:K3","v":"2026-05-20"},null,null,{"$f":"'Div 1'!L3:N3","v":"2026-05-27"},null,null,{"$f":"'Div 1'!O3:Q3","v":"2026-06-03"},null,null,{"$f":"'Div 1'!R3:T3","v":"2026-06-10"},null,null,{"$f":"'Div 1'!U3:W3","v":"2026-06-17"},null,null,null,1,"2026-05-06",{"$f":"IF(SUM(C6:C13)>0,1,0)","v":1},{"$f":"IF(E16=\"error\",1,0)","v":0}]
[null,null,"Week 1",null,null,"Week 2",null,null,"Week 3",null,null,"Week 4",null,null,"Week 5",null,null,"Week 6",null,null,"Week 7",null,null,null,2,{"$f":"Z3+7","v":"2026-05-13"},{"$f":"IF(SUM(F6:F13)>0,1,0)","v":0},{"$f":"IF(H16=\"error\",1,0)","v":0}]
[null,null,"For","Against","Points","For","Against","Points","For","Against","Points","For","Against","Points","For","Against","Points","For","Against","Points","For","Against","Points",null,3,{"$f":"Z4+7","v":"2026-05-20"},{"$f":"IF(SUM(I6:I13)>0,1,0)","v":0},{"$f":"IF(K16=\"error\",1,0)","v":0}]
["A","Billericay",36,49,4,null,null,null,null,null,null,null,null,null,null,null,null,null,null,null,null,null,null,null,4,"2026-05-27",{"$f":"IF(SUM(L6:L13)>0,1,0)","v":0},{"$f":"IF(N16=\"error\",1,0)","v":0}]
["B","Chelmsford B",49,52,4,null,null,null,null,null,null,null,null,null,null,null,null,null,null,null,null,null,null,null,5,"2026-06-03",{"$f":"IF(SUM(O6:O13)>0,1,0)","v":0},{"$f":"IF(Q16=\"error\",1,0)","v":0}]
["C","Danbury B",36,69,2,null,null,null,null,null,null,null,null,null,null,null,null,null,null,null,null,null,null,null,6,"2026-06-10",{"$f":"IF(SUM(R6:R13)>0,1,0)","v":0},{"$f":"IF(T16=\"error\",1,0)","v":0}]
["D","Falcon B",43,58,2,null,null,null,null,null,null,null,null,null,null,null,null,null,null,null,null,null,null,null,7,"2026-06-17",{"$f":"IF(SUM(U6:U13)>0,1,0)","v":0},{"$f":"IF(W16=\"error\",1,0)","v":0}]
["E","Gt_Baddow B",52,49,6,null,null,null,null,null,null,null,null,null,null,null,null,null,null,null,null,null,null,null,8,{"$f":"Z9+14","v":"2026-07-01"},{"$f":"IF(SUM(C21:C28)>0,1,0)","v":0},{"$f":"IF(E32=\"error\",1,0)","v":0}]
["F","Ingatestone",49,36,6,null,null,null,null,null,null,null,null,null,null,null,null,null,null,null,null,null,null,null,9,"2026-07-08",{"$f":"IF(SUM(F21:F28)>0,1,0)","v":0},{"$f":"IF(H32=\"error\",1,0)","v":0}]
["G","Maldon C",58,43,8,null,null,null,null,null,null,null,null,null,null,null,null,null,null,null,null,null,null,null,10,"2026-07-15",{"$f":"IF(SUM(I21:I28)>0,1,0)","v":0},{"$f":"IF(K32=\"error\",1,0)","v":0}]
["H","PML",69,36,8,null,null,null,null,null,null,null,null,null,null,null,null,null,null,null,null,null,null,null,11,"2026-07-22",{"$f":"IF(SUM(L21:L28)>0,1,0)","v":0},{"$f":"IF(N32=\"error\",1,0)","v":0}]
[null,null,null,null,null,null,null,null,null,null,null,null,null,null,null,null,null,null,null,null,null,null,null,null,12,"2026-07-29",{"$f":"IF(SUM(O21:O28)>0,1,0)","v":0},{"$f":"IF(Q32=\"error\",1,0)","v":0}]
[null,null,{"$f":"SUM(C6:C13)","v":392},392,40,0,0,0,0,0,0,0,0,0,0,0,0,0,0,0,0,0,0,null,13,"2026-08-05",{"$f":"IF(SUM(R21:R28)>0,1,0)","v":0},{"$f":"IF(T32=\"error\",1,0)","v":0}]
[null,null,{"$f":"IF(C15<>D15,\"error\",IF(SUM(C7:C13)+SUM(D7:D13)=0,\"\",\"correct\"))","v":"correct"},null,{"$f":"IF(E15=0,\"\",IF(E15=Y1,\"correct\",\"error\"))","v":"correct"},{"$f":"IF(F15<>G15,\"error\",IF(SUM(F7:F13)+SUM(G7:G13)=0,\"\",\"correct\"))","v":""},null,{"$f":"IF(H15=0,\"\",IF(H15=Y1,\"correct\",\"error\"))","v":""},{"$f":"IF(I15<>J15,\"error\",IF(SUM(I7:I13)+SUM(J7:J13)=0,\"\",\"correct\"))","v":""},null,{"$f":"IF(K15=0,\"\",IF(K15=Y1,\"correct\",\"error\"))","v":""},{"$f":"IF(L15<>M15,\"error\",IF(SUM(L7:L13)+SUM(M7:M13)=0,\"\",\"correct\"))","v":""},null,{"$f":"IF(N15=0,\"\",IF(N15=Y1,\"correct\",\"error\"))","v":""},{"$f":"IF(O15<>P15,\"error\",IF(SUM(O7:O13)+SUM(P7:P13)=0,\"\",\"correct\"))","v":""},null,{"$f":"IF(Q15=0,\"\",IF(Q15=Y1,\"correct\",\"error\"))","v":""},{"$f":"IF(R15<>S15,\"error\",IF(SUM(R7:R13)+SUM(S7:S13)=0,\"\",\"correct\"))","v":""},null,{"$f":"IF(T15=0,\"\",IF(T15=Y1,\"correct\",\"error\"))","v":""},{"$f":"IF(U15<>V15,\"error\",IF(SUM(U7:U13)+SUM(V7:V13)=0,\"\",\"correct\"))","v":""},null,{"$f":"IF(W15=0,\"\",IF(W15=Y1,\"correct\",\"error\"))","v":""},null,14,"2026-08-12",{"$f":"IF(SUM(U21:U28)>0,1,0)","v":0},{"$f":"IF(W32=\"error\",1,0)","v":0}]
[null,null,null,null,{"$f":"IF(E16=\"\",\"\",IF(E15/10-INT(E15/10)=0,\"correct\",\"error\"))","v":"correct"},null,{"$f":"IF(G16=\"\",\"\",IF(G15/10-INT(G15/10)=0,\"correct\",\"error\"))","v":""},"",null,"","",null,"","",null,"","",null,"","",null,"","",null,null,{"$f":"VLOOKUP(MATCH(0,AA3:AA16,0)-1,Y3:Z16,2)","v":"2026-05-06"}]
[null,null,null,null,null,null,null,null,null,null,null,null,null,null,null,null,null,null,null,null,null,null,null,null,null,null,{"$f":"SUM(AA3:AA16)","v":1},{"$f":"IF(SUM(AB3:AB16)>0,\"Awaiting some results\",\"\")","v":""}]
[null,null,{"$f":"'Div 1'!C19:E19","v":"2026-07-01"},null,null,{"$f":"'Div 1'!F19:H19","v":"2026-07-08"},null,null,{"$f":"'Div 1'!I19:K19","v":"2026-07-15"},null,null,{"$f":"'Div 1'!L19:N19","v":"2026-07-22"},null,null,{"$f":"'Div 1'!O19:Q19","v":"2026-07-29"},null,null,{"$f":"'Div 1'!R19:T19","v":"2026-08-05"},null,null,{"$f":"'Div 1'!U19:W19","v":"2026-08-12"}]
[null,null,"Week 8",null,null,"Week 9",null,null,"Week 10",null,null,"Week 11",null,null,"Week 12",null,null,"Week 13",null,null,"Week 14"]
[null,null,"For","Against","Points","For","Against","Points","For","Against","Points","For","Against","Points","For","Against","Points","For","Against","Points","For","Against","Points"]
["A","Billericay"]
["B","Chelmsford B"]
["C","Danbury B"]
["D","Falcon B"]
["E","Gt_Baddow B"]
["F","Ingatestone"]
["G","Maldon C"]
["H","PML"]
[]
[null,null,{"$f":"SUM(C22:C29)","v":0},0,0,0,0,0,0,0,0,0,0,0,0,0,0,0,0,0,0,0,0]
[null,null,{"$f":"IF(C31<>D31,\"error\",IF(SUM(C22:C29)+SUM(D22:D29)=0,\"\",\"correct\"))","v":""},null,{"$f":"IF(E31=0,\"\",IF(E31=Y1,\"correct\",\"error\"))","v":""},{"$f":"IF(F31<>G31,\"error\",IF(SUM(F22:F29)+SUM(G22:G29)=0,\"\",\"correct\"))","v":""},null,{"$f":"IF(H31=0,\"\",IF(H31=Y1,\"correct\",\"error\"))","v":""},{"$f":"IF(I31<>J31,\"error\",IF(SUM(I22:I29)+SUM(J22:J29)=0,\"\",\"correct\"))","v":""},null,{"$f":"IF(K31=0,\"\",IF(K31=Y1,\"correct\",\"error\"))","v":""},{"$f":"IF(L31<>M31,\"error\",IF(SUM(L22:L29)+SUM(M22:M29)=0,\"\",\"correct\"))","v":""},null,{"$f":"IF(N31=0,\"\",IF(N31=Y1,\"correct\",\"error\"))","v":""},{"$f":"IF(O31<>P31,\"error\",IF(SUM(O22:O29)+SUM(P22:P29)=0,\"\",\"correct\"))","v":""},null,{"$f":"IF(Q31=0,\"\",IF(Q31=Y1,\"correct\",\"error\"))","v":""},{"$f":"IF(R31<>S31,\"error\",IF(SUM(R22:R29)+SUM(S22:S29)=0,\"\",\"correct\"))","v":""},null,{"$f":"IF(T31=0,\"\",IF(T31=Y1,\"correct\",\"error\"))","v":""},{"$f":"IF(U31<>V31,\"error\",IF(SUM(U22:U29)+SUM(V22:V29)=0,\"\",\"correct\"))","v":""},null,{"$f":"IF(W31=0,\"\",IF(W31=Y1,\"correct\",\"error\"))","v":""}]
[null,null,null,null,{"$f":"IF(E32=\"\",\"\",IF(E31/10-INT(E31/10)=0,\"correct\",\"error\"))","v":""},null,null,{"$f":"IF(H32=\"\",\"\",IF(H31/10-INT(H31/10)=0,\"correct\",\"error\"))","v":""},null,null,"",null,null,"",null,null,"",null,null,"",null,null,""]
[]
[null,null,"Totals for season",null,null,null,null,null,null,null,null,null,"Resulrs for first half of season",null,null,null,null,null,null,null,null,"Resulrs for second half of season"]
[null,null,"Played","Won","Drew","Lost","Shots For","Shot Against","Shot Diff","Points",null,null,"Won","Drew","Lost","For","Against","Points",null,null,null,"Won","Drew","Lost","For","Against","Points"]
["A","Billericay",{"$f":"COUNTA(C6:W6)/3+COUNTA(C22:W22)/3","v":1},{"$f":"M37+V37","v":0},{"$f":"N37+W37","v":0},8,36,49,{"$f":"G37-H37","v":-13},{"$f":"R37+AA37","v":4},null,null,{"$f":"IF(E6>5,1,0)+IF(H6>5,1,0)+IF(K6>5,1,0)+IF(N6>5,1,0)+IF(Q6>5,1,0)+IF(T6>5,1,0)+IF(W6>5,1,0)","v":0},{"$f":"IF(E6=5,1,0)+IF(H6=5,1,0)+IF(K6=5,1,0)+IF(N6=5,1,0)+IF(Q6=5,1,0)+IF(T6=5,1,0)+IF(W6=5,1,0)","v":0},{"$f":"IF(E6=\"\",0,IF(E6<5,1,0))+IF(H6=\"\",0,IF(H6<5,1,0))+IF(K6=\"\",0,IF(K6<5,1,0))+IF(N6=\"\",0,IF(N6<5,1,0))+IF(Q6=\"\",0,IF(Q6<5,1,0))+IF(T6=\"\",0,IF(T6<5,1,0))+IF(W6=\"\",0,IF(W6<5,1,0))","v":1},{"$f":"C6+F6+I6+L6+O6+R6+U6","v":36},49,4,null,null,null,{"$f":"IF(E22>5,1,0)+IF(H22>5,1,0)+IF(K22>5,1,0)+IF(N22>5,1,0)+IF(Q22>5,1,0)+IF(T22>5,1,0)+IF(W22>5,1,0)","v":0},{"$f":"IF(E22=5,1,0)+IF(H22=5,1,0)+IF(K22=5,1,0)+IF(N22=5,1,0)+IF(Q22=5,1,0)+IF(T22=5,1,0)+IF(W22=5,1,0)","v":0},{"$f":"IF(E22<5,1,0)+IF(H22<5,1,0)+IF(K22<5,1,0)+IF(N22<5,1,0)+IF(Q22<5,1,0)+IF(T22<5,1,0)+IF(W22<5,1,0)","v":7},{"$f":"C22+F22+I22+L22+O22+R22+U22","v":0},{"$f":"D22+G22+J22+M22+P22+S22+V22","v":0},{"$f":"E22+H22+K22+N22+Q22+T22+W22","v":0}]
["B","Chelmsford B",1,{"$f":"M38+V38","v":0},{"$f":"N38+W38","v":0},{"$f":"O38+X38","v":8},{"$f":"P38+Y38","v":49},{"$f":"Q38+Z38","v":52},{"$f":"G38-H38","v":-3},{"$f":"R38+AA38","v":4},null,null,0,0,1,49,52,4,null,null,null,{"$f":"IF(E23>5,1,0)+IF(H23>5,1,0)+IF(K23>5,1,0)+IF(N23>5,1,0)+IF(Q23>5,1,0)+IF(T23>5,1,0)+IF(W23>5,1,0)","v":0},{"$f":"IF(E23=5,1,0)+IF(H23=5,1,0)+IF(K23=5,1,0)+IF(N23=5,1,0)+IF(Q23=5,1,0)+IF(T23=5,1,0)+IF(W23=5,1,0)","v":0},{"$f":"IF(E23<5,1,0)+IF(H23<5,1,0)+IF(K23<5,1,0)+IF(N23<5,1,0)+IF(Q23<5,1,0)+IF(T23<5,1,0)+IF(W23<5,1,0)","v":7},{"$f":"C23+F23+I23+L23+O23+R23+U23","v":0},0,0]
["C","Danbury B",1,0,0,8,36,69,-33,2,null,null,0,0,1,36,69,2,null,null,null,0,0,7,{"$f":"C24+F24+I24+L24+O24+R24+U24","v":0},0,0]
["D","Falcon B",1,0,0,8,43,58,-15,2,null,null,0,0,1,43,58,2,null,null,null,0,0,7,{"$f":"C25+F25+I25+L25+O25+R25+U25","v":0},0,0]
["E","Gt_Baddow B",1,1,0,7,52,49,3,6,null,null,1,0,0,52,49,6,null,null,null,0,0,7,{"$f":"C26+F26+I26+L26+O26+R26+U26","v":0},0,0]
["F","Ingatestone",1,1,0,7,49,36,13,6,null,null,1,0,0,49,36,6,null,null,null,0,0,7,{"$f":"C27+F27+I27+L27+O27+R27+U27","v":0},0,0]
["G","Maldon C",1,1,0,7,58,43,15,8,null,null,1,0,0,58,43,8,null,null,null,0,0,7,{"$f":"C28+F28+I28+L28+O28+R28+U28","v":0},0,0]
["H","PML",1,1,0,7,69,36,33,8,null,null,1,0,0,69,36,8,null,null,null,0,0,7,{"$f":"C29+F29+I29+L29+O29+R29+U29","v":0},0,0]

{"sheet":"Div 4","index":4,"n_rows":36,"n_cols":28,"rows_kept":36,"cut":false,"hidden":false,"merged":[[16,2,16,4],[16,5,16,7],[16,8,16,10],[16,11,16,13],[16,14,16,16],[15,14,15,16],[12,14,12,15],[3,2,3,4],[3,5,3,7],[3,8,3,10],[3,11,3,13],[3,14,3,16],[2,5,2,7],[2,8,2,10],[2,11,2,13],[15,2,15,4],[15,5,15,7],[15,8,15,10],[15,11,15,13],[0,23,1,23],[29,2,29,9],[29,12,29,17],[29,21,29,26],[25,2,25,3],[25,5,25,6],[25,8,25,9],[25,11,25,12],[25,14,25,15],[12,2,12,3],[12,5,12,6],[12,8,12,9],[2,14,2,16],[0,1,0,22],[12,11,12,12],[2,2,2,4]]}
[null,"Division 4   2026",null,null,null,null,null,null,null,null,null,null,null,null,null,null,null,null,null,null,null,null,null,null,20]
[]
[null,null,{"$f":"Z3","v":"2025-05-13"},null,null,{"$f":"Z4","v":"2026-05-20"},null,null,{"$f":"Z5","v":"2026-05-27"},null,null,{"$f":"Z6","v":"2025-06-10"},null,null,{"$f":"Z7","v":"2026-06-17"},null,null,null,null,null,null,null,null,null,1,"2025-05-13",{"$f":"IF(SUM(C6:C10)>0,1,0)","v":0},{"$f":"IF(E13=\"error\",1,0)","v":0}]
[null,null,"Week 1",null,null,"Week 2",null,null,"Week 3",null,null,"Week 4",null,null,"Week 5",null,null,null,null,null,null,null,null,null,2,"2026-05-20",{"$f":"IF(SUM(F6:F10)>0,1,0)","v":0},{"$f":"IF(H13=\"error\",1,0)","v":0}]
[null,null,"For","Against","Points","For","Against","Points","For","Against","Points","For","Against","Points","For","Against","Points",null,null,null,null,null,null,null,3,"2026-05-27",{"$f":"IF(SUM(I6:I10)>0,1,0)","v":0},{"$f":"IF(K13=\"error\",1,0)","v":0}]
["A","Burnham B",null,null,null,null,null,null,null,null,null,null,null,null,null,null,null,null,null,null,null,null,null,null,4,"2025-06-10",{"$f":"IF(SUM(L6:L10)>0,1,0)","v":0},{"$f":"IF(N13=\"error\",1,0)","v":0}]
["B","Falcon C",null,null,null,null,null,null,null,null,null,null,null,null,null,null,null,null,null,null,null,null,null,null,5,"2026-06-17",{"$f":"IF(SUM(O6:O10)>0,1,0)","v":0},{"$f":"IF(Q13=\"error\",1,0)","v":0}]
["C","Gt_Baddow C",null,null,null,null,null,null,null,null,null,null,null,null,null,null,null,null,null,null,null,null,null,null,6,"2026-07-01",{"$f":"IF(SUM(C19:C23)>0,1,0)","v":0},{"$f":"IF(E26=\"error\",1,0)","v":0}]
["D","Stock C",null,null,null,null,null,null,null,null,null,null,null,null,null,null,null,null,null,null,null,null,null,null,7,"2026-07-15",{"$f":"IF(SUM(F19:F23)>0,1,0)","v":0},{"$f":"IF(H26=\"error\",1,0)","v":0}]
["E","Writtle C",null,null,null,null,null,null,null,null,null,null,null,null,null,null,null,null,null,null,null,null,null,null,8,"2026-07-29",{"$f":"IF(SUM(I19:I23)>0,1,0)","v":0},{"$f":"IF(K26=\"error\",1,0)","v":0}]
[null,null,null,null,null,null,null,null,null,null,null,null,null,null,null,null,null,null,null,null,null,null,null,null,9,"2026-08-05",{"$f":"IF(SUM(L19:L23)>0,1,0)","v":0},{"$f":"IF(Q26=\"error\",1,0)","v":0}]
[null,null,{"$f":"SUM(C6:C11)","v":0},{"$f":"SUM(D6:D11)","v":0},{"$f":"SUM(E6:E10)","v":0},{"$f":"SUM(F6:F11)","v":0},0,0,0,0,0,0,0,0,0,0,0,null,null,null,null,null,null,null,10,"2026-08-12",{"$f":"IF(SUM(O19:O23)>0,1,0)","v":0},0]
[null,null,{"$f":"IF(C12<>D12,\"error\",IF(SUM(C6:C10)+SUM(D6:D10)=0,\"\",\"correct\"))","v":""},null,{"$f":"IF(E12=0,\"\",IF(E12=Y1,\"correct\",\"error\"))","v":""},{"$f":"IF(F12<>G12,\"error\",IF(SUM(F6:F10)+SUM(G6:G10)=0,\"\",\"correct\"))","v":""},null,{"$f":"IF(H12=0,\"\",IF(H12=Y1,\"correct\",\"error\"))","v":""},{"$f":"IF(I12<>J12,\"error\",IF(SUM(I6:I10)+SUM(J6:J10)=0,\"\",\"correct\"))","v":""},null,{"$f":"IF(K12=0,\"\",IF(K12=Y1,\"correct\",\"error\"))","v":""},{"$f":"IF(L12<>M12,\"error\",IF(SUM(L6:L10)+SUM(M6:M10)=0,\"\",\"correct\"))","v":""},null,{"$f":"IF(N12=0,\"\",IF(N12=Y1,\"correct\",\"error\"))","v":""},{"$f":"IF(O12<>P12,\"error\",IF(SUM(O6:O10)+SUM(P6:P10)=0,\"\",\"correct\"))","v":""},null,{"$f":"IF(Q12=0,\"\",IF(Q12=Y1,\"correct\",\"error\"))","v":""},null,null,null,null,null,null,null,null,{"$f":"VLOOKUP(MATCH(0,AA3:AA12,0)-1,Y3:Z12,2)","v":{"$error":"#N/A"}}]
[null,null,null,null,{"$f":"IF(E13=\"\",\"\",IF(E12/10-INT(E12/10)=0,\"correct\",\"error\"))","v":""},null,null,{"$f":"IF(H13=\"\",\"\",IF(H12/10-INT(H12/10)=0,\"correct\",\"error\"))","v":""},null,null,"",null,null,"",null,null,"",null,null,null,null,null,null,null,null,null,{"$f":"SUM(AA3:AA12)","v":0},{"$f":"IF(SUM(AB3:AB12)>0,\"Awaiting some results\",\"\")","v":""}]
[]
[null,null,{"$f":"Z8","v":"2026-07-01"},null,null,{"$f":"Z9","v":"2026-07-15"},null,null,{"$f":"Z10","v":"2026-07-29"},null,null,{"$f":"Z11","v":"2026-08-05"},null,null,{"$f":"Z12","v":"2026-08-12"}]
[null,null,"Week 6",null,null,"Week 7",null,null,"Week 8",null,null,"Week 9",null,null,"Week 10"]
[null,null,"For","Against","Points","For","Against","Points","For","Against","Points","For","Against","Points","For","Against","Points"]
["A","Burnham B"]
["B","Falcon C"]
["C","Gt_Baddow C"]
["D","Stock C"]
["E","Writtle C"]
[]
[null,null,{"$f":"SUM(C19:C24)","v":0},0,0,0,0,0,0,0,0,0,0,0,0,0,0]
[null,null,{"$f":"IF(C25<>D25,\"error\",IF(SUM(C19:C23)+SUM(D19:D23)=0,\"\",\"correct\"))","v":""},null,{"$f":"IF(E25=0,\"\",IF(E25=Y1,\"correct\",\"error\"))","v":""},{"$f":"IF(F25<>G25,\"error\",IF(SUM(F19:F23)+SUM(G19:G23)=0,\"\",\"correct\"))","v":""},null,{"$f":"IF(H25=0,\"\",IF(H25=Y1,\"correct\",\"error\"))","v":""},{"$f":"IF(I25<>J25,\"error\",IF(SUM(I19:I23)+SUM(J19:J23)=0,\"\",\"correct\"))","v":""},null,{"$f":"IF(K25=0,\"\",IF(K25=Y1,\"correct\",\"error\"))","v":""},{"$f":"IF(L25<>M25,\"error\",IF(SUM(L19:L23)+SUM(M19:M23)=0,\"\",\"correct\"))","v":""},null,{"$f":"IF(N25=0,\"\",IF(N25=Y1,\"correct\",\"error\"))","v":""},{"$f":"IF(O25<>P25,\"error\",IF(SUM(O19:O23)+SUM(P19:P23)=0,\"\",\"correct\"))","v":""},null,{"$f":"IF(Q25=0,\"\",IF(Q25=Y1,\"correct\",\"error\"))","v":""}]
[null,null,null,null,{"$f":"IF(E26=\"\",\"\",IF(E25/10-INT(E25/10)=0,\"correct\",\"error\"))","v":""},null,null,{"$f":"IF(H26=\"\",\"\",IF(H25/10-INT(H25/10)=0,\"correct\",\"error\"))","v":""},null,null,"",null,null,"",null,null,""]
[]
[]
[null,null,"Totals for season",null,null,null,null,null,null,null,null,null,"Resulrs for first half of season",null,null,null,null,null,null,null,null,"Resulrs for second half of season"]
[null,null,"Played","Won","Drew","Lost","Shots For","Shot Against","Shot Diff","Points",null,null,"Won","Drew","Lost","For","Against","Points",null,null,null,"Won","Drew","Lost","For","Against","Points"]
["A","Burnham B",{"$f":"COUNTA(C6:W6)/3+COUNTA(C19:W19)/3","v":0},{"$f":"M32+V32","v":0},0,0,0,0,{"$f":"G32-H32","v":0},{"$f":"R32+AA32","v":0},null,null,{"$f":"IF(E6>5,1,0)+IF(H6>5,1,0)+IF(K6>5,1,0)+IF(N6>5,1,0)+IF(Q6>5,1,0)+IF(T6>5,1,0)+IF(W6>5,1,0)","v":0},{"$f":"IF(E6=5,1,0)+IF(H6=5,1,0)+IF(K6=5,1,0)+IF(N6=5,1,0)+IF(Q6=5,1,0)+IF(T6=5,1,0)+IF(W6=5,1,0)","v":0},{"$f":"IF(E6=\"\",0,IF(E6<5,1,0))+IF(H6=\"\",0,IF(H6<5,1,0))+IF(K6=\"\",0,IF(K6<5,1,0))+IF(N6=\"\",0,IF(N6<5,1,0))+IF(Q6=\"\",0,IF(Q6<5,1,0))+IF(T6=\"\",0,IF(T6<5,1,0))+IF(W6=\"\",0,IF(W6<5,1,0))","v":0},{"$f":"C6+F6+I6+L6+O6+R6+U6","v":0},0,0,null,null,null,{"$f":"IF(E19>5,1,0)+IF(H19>5,1,0)+IF(K19>5,1,0)+IF(N19>5,1,0)+IF(Q19>5,1,0)+IF(T19>5,1,0)+IF(W19>5,1,0)","v":0},{"$f":"IF(E19=5,1,0)+IF(H19=5,1,0)+IF(K19=5,1,0)+IF(N19=5,1,0)+IF(Q19=5,1,0)+IF(T19=5,1,0)+IF(W19=5,1,0)","v":0},{"$f":"IF(E19=\"\",0,IF(E19<5,1,0))+IF(H19=\"\",0,IF(H19<5,1,0))+IF(K19=\"\",0,IF(K19<5,1,0))+IF(N19=\"\",0,IF(N19<5,1,0))+IF(Q19=\"\",0,IF(Q19<5,1,0))+IF(T19=\"\",0,IF(T19<5,1,0))+IF(W19=\"\",0,IF(W19<5,1,0))","v":0},{"$f":"C19+F19+I19+L19+O19+R19+U19","v":0},0,0]
["B","Falcon C",{"$f":"COUNTA(C7:W7)/3+COUNTA(C20:W20)/3","v":0},0,0,0,0,0,{"$f":"G33-H33","v":0},{"$f":"R33+AA33","v":0},null,null,{"$f":"IF(E7>5,1,0)+IF(H7>5,1,0)+IF(K7>5,1,0)+IF(N7>5,1,0)+IF(Q7>5,1,0)+IF(T7>5,1,0)+IF(W7>5,1,0)","v":0},{"$f":"IF(E7=5,1,0)+IF(H7=5,1,0)+IF(K7=5,1,0)+IF(N7=5,1,0)+IF(Q7=5,1,0)+IF(T7=5,1,0)+IF(W7=5,1,0)","v":0},{"$f":"IF(E7=\"\",0,IF(E7<5,1,0))+IF(H7=\"\",0,IF(H7<5,1,0))+IF(K7=\"\",0,IF(K7<5,1,0))+IF(N7=\"\",0,IF(N7<5,1,0))+IF(Q7=\"\",0,IF(Q7<5,1,0))+IF(T7=\"\",0,IF(T7<5,1,0))+IF(W7=\"\",0,IF(W7<5,1,0))","v":0},0,0,0,null,null,null,{"$f":"IF(E20>5,1,0)+IF(H20>5,1,0)+IF(K20>5,1,0)+IF(N20>5,1,0)+IF(Q20>5,1,0)+IF(T20>5,1,0)+IF(W20>5,1,0)","v":0},{"$f":"IF(E20=5,1,0)+IF(H20=5,1,0)+IF(K20=5,1,0)+IF(N20=5,1,0)+IF(Q20=5,1,0)+IF(T20=5,1,0)+IF(W20=5,1,0)","v":0},{"$f":"IF(E20=\"\",0,IF(E20<5,1,0))+IF(H20=\"\",0,IF(H20<5,1,0))+IF(K20=\"\",0,IF(K20<5,1,0))+IF(N20=\"\",0,IF(N20<5,1,0))+IF(Q20=\"\",0,IF(Q20<5,1,0))+IF(T20=\"\",0,IF(T20<5,1,0))+IF(W20=\"\",0,IF(W20<5,1,0))","v":0},0,0,0]
["C","Gt_Baddow C",{"$f":"COUNTA(C8:W8)/3+COUNTA(C21:W21)/3","v":0},0,0,0,0,0,0,{"$f":"R34+AA34","v":0},null,null,{"$f":"IF(E8>5,1,0)+IF(H8>5,1,0)+IF(K8>5,1,0)+IF(N8>5,1,0)+IF(Q8>5,1,0)+IF(T8>5,1,0)+IF(W8>5,1,0)","v":0},{"$f":"IF(E8=5,1,0)+IF(H8=5,1,0)+IF(K8=5,1,0)+IF(N8=5,1,0)+IF(Q8=5,1,0)+IF(T8=5,1,0)+IF(W8=5,1,0)","v":0},{"$f":"IF(E8=\"\",0,IF(E8<5,1,0))+IF(H8=\"\",0,IF(H8<5,1,0))+IF(K8=\"\",0,IF(K8<5,1,0))+IF(N8=\"\",0,IF(N8<5,1,0))+IF(Q8=\"\",0,IF(Q8<5,1,0))+IF(T8=\"\",0,IF(T8<5,1,0))+IF(W8=\"\",0,IF(W8<5,1,0))","v":0},0,0,0,null,null,null,{"$f":"IF(E21>5,1,0)+IF(H21>5,1,0)+IF(K21>5,1,0)+IF(N21>5,1,0)+IF(Q21>5,1,0)+IF(T21>5,1,0)+IF(W21>5,1,0)","v":0},{"$f":"IF(E21=5,1,0)+IF(H21=5,1,0)+IF(K21=5,1,0)+IF(N21=5,1,0)+IF(Q21=5,1,0)+IF(T21=5,1,0)+IF(W21=5,1,0)","v":0},{"$f":"IF(E21=\"\",0,IF(E21<5,1,0))+IF(H21=\"\",0,IF(H21<5,1,0))+IF(K21=\"\",0,IF(K21<5,1,0))+IF(N21=\"\",0,IF(N21<5,1,0))+IF(Q21=\"\",0,IF(Q21<5,1,0))+IF(T21=\"\",0,IF(T21<5,1,0))+IF(W21=\"\",0,IF(W21<5,1,0))","v":0},0,0,0]
["D","Stock C",{"$f":"COUNTA(C9:W9)/3+COUNTA(C22:W22)/3","v":0},0,0,0,0,0,0,{"$f":"R35+AA35","v":0},null,null,{"$f":"IF(E9>5,1,0)+IF(H9>5,1,0)+IF(K9>5,1,0)+IF(N9>5,1,0)+IF(Q9>5,1,0)+IF(T9>5,1,0)+IF(W9>5,1,0)","v":0},{"$f":"IF(E9=5,1,0)+IF(H9=5,1,0)+IF(K9=5,1,0)+IF(N9=5,1,0)+IF(Q9=5,1,0)+IF(T9=5,1,0)+IF(W9=5,1,0)","v":0},{"$f":"IF(E9=\"\",0,IF(E9<5,1,0))+IF(H9=\"\",0,IF(H9<5,1,0))+IF(K9=\"\",0,IF(K9<5,1,0))+IF(N9=\"\",0,IF(N9<5,1,0))+IF(Q9=\"\",0,IF(Q9<5,1,0))+IF(T9=\"\",0,IF(T9<5,1,0))+IF(W9=\"\",0,IF(W9<5,1,0))","v":0},0,0,0,null,null,null,{"$f":"IF(E22>5,1,0)+IF(H22>5,1,0)+IF(K22>5,1,0)+IF(N22>5,1,0)+IF(Q22>5,1,0)+IF(T22>5,1,0)+IF(W22>5,1,0)","v":0},{"$f":"IF(E22=5,1,0)+IF(H22=5,1,0)+IF(K22=5,1,0)+IF(N22=5,1,0)+IF(Q22=5,1,0)+IF(T22=5,1,0)+IF(W22=5,1,0)","v":0},{"$f":"IF(E22=\"\",0,IF(E22<5,1,0))+IF(H22=\"\",0,IF(H22<5,1,0))+IF(K22=\"\",0,IF(K22<5,1,0))+IF(N22=\"\",0,IF(N22<5,1,0))+IF(Q22=\"\",0,IF(Q22<5,1,0))+IF(T22=\"\",0,IF(T22<5,1,0))+IF(W22=\"\",0,IF(W22<5,1,0))","v":0},0,0,0]
["E","Writtle C",{"$f":"COUNTA(C10:W10)/3+COUNTA(C23:W23)/3","v":0},0,0,0,0,0,0,{"$f":"R36+AA36","v":0},null,null,{"$f":"IF(E10>5,1,0)+IF(H10>5,1,0)+IF(K10>5,1,0)+IF(N10>5,1,0)+IF(Q10>5,1,0)+IF(T10>5,1,0)+IF(W10>5,1,0)","v":0},{"$f":"IF(E10=5,1,0)+IF(H10=5,1,0)+IF(K10=5,1,0)+IF(N10=5,1,0)+IF(Q10=5,1,0)+IF(T10=5,1,0)+IF(W10=5,1,0)","v":0},{"$f":"IF(E10=\"\",0,IF(E10<5,1,0))+IF(H10=\"\",0,IF(H10<5,1,0))+IF(K10=\"\",0,IF(K10<5,1,0))+IF(N10=\"\",0,IF(N10<5,1,0))+IF(Q10=\"\",0,IF(Q10<5,1,0))+IF(T10=\"\",0,IF(T10<5,1,0))+IF(W10=\"\",0,IF(W10<5,1,0))","v":0},0,0,0,null,null,null,{"$f":"IF(E23>5,1,0)+IF(H23>5,1,0)+IF(K23>5,1,0)+IF(N23>5,1,0)+IF(Q23>5,1,0)+IF(T23>5,1,0)+IF(W23>5,1,0)","v":0},{"$f":"IF(E23=5,1,0)+IF(H23=5,1,0)+IF(K23=5,1,0)+IF(N23=5,1,0)+IF(Q23=5,1,0)+IF(T23=5,1,0)+IF(W23=5,1,0)","v":0},{"$f":"IF(E23=\"\",0,IF(E23<5,1,0))+IF(H23=\"\",0,IF(H23<5,1,0))+IF(K23=\"\",0,IF(K23<5,1,0))+IF(N23=\"\",0,IF(N23<5,1,0))+IF(Q23=\"\",0,IF(Q23<5,1,0))+IF(T23=\"\",0,IF(T23<5,1,0))+IF(W23=\"\",0,IF(W23<5,1,0))","v":0},0,0,0]

{"sheet":"Cups","index":5,"n_rows":47,"n_cols":11,"rows_kept":47,"cut":false,"hidden":false,"merged":[[45,0,45,12],[46,0,46,12],[31,0,31,12],[32,0,32,12],[35,0,35,12],[37,0,37,12],[39,0,39,12],[36,0,36,10],[38,0,38,10],[40,0,40,12],[41,0,41,12],[42,0,42,12],[44,0,44,12],[26,0,26,12],[27,0,27,12],[0,0,0,12],[1,0,1,12],[2,0,2,12],[8,0,8,12],[9,0,9,12],[13,0,13,12],[14,0,14,12],[17,0,17,12],[19,0,19,12],[20,0,20,12]]}
["Competition Draw 2026 TEAM KNOCKOUT"]
["The \"ATKINSON\" SHIELD"]
["First Round  24th June"]
["Game 1","Danbury A","v","Lionmede",null,null,null,"Game 2","Burnham A","v","Maldon A"]
["Game 3","Falcon A","v","Maldon B",null,null,null,"Game 4","Stock A","v","Southminster"]
["Game 5","Writtle B","v","Writtle A",null,null,null,"Game 6","RHP A","v","SWF"]
["Game 7","Tillingham","v","Chelmsford A",null,null,null,"Game 8","Gt_Baddow A","v","Stock B"]
[]
["Quarter-Final    play by date 22nd July"]
["Winners of games from round 1"]
["Game A",1,"v",4,null,null,null,"Game B",5,"v",3]
["Game C",7,"v",2,null,null,null,"Game D",6,"v",8]
[]
["Semi-Final   play by date 19th August"]
["Winners of games from Quarter-Final"]
["Game E","A","v","D",null,null,null,"Game F","B","v","C"]
[]
["Final 6th September AM venue Tillingham"]
[]
["LEAGUE (Marconi) CUP"]
["First Round  24th June"]
["Game 1","Danbury B","v","BYE",null,null,null,"Game 2","Burnham B","v","Gt_Baddow C"]
["Game 3","Gt_Baddow B","v","BY4",null,null,null,"Game 4","Maldon C","v","Falcon B"]
["Game 5","Chelmsford B","v","Writtle C",null,null,null,"Game 6","PML","v","Billericay"]
["Game 7","Falcon C","v","BYE",null,null,null,"Game 8","Ingatestone","v","Stock C"]
[]
["Quarter-Final    play by date 22nd July"]
["Winner of games from round 1"]
["Game A",8,"v",1,null,null,null,"Game B",6,"v",4]
["Game C",3,"v",7,null,null,null,"Game D",2,"v",5]
[]
["Semi-Final   play by date 19th August"]
["Winner of games from Quarter-Final"]
["Game E","D","v","C",null,null,null,"Game F","B","v","A"]
[]
["Final 6th September AM venue Burnham"]
[]
["Straight Draw applies to all rounds other than the final"]
[]
["Notice to Captains"]
["Atkinson Shield and Marconi cups: Both sets of score cards must be returned, duly signed by both"]
["captains to Mike Lenard (Hon League Secretary) 22 Ridgeway, Ingatestone Essex, CM4 9AS"]
["Tel 01277 352458/07707 685008  email mike.cdbowls@gmail.com. "]
[]
["Please note that the ‘default date’ for the first round of the Atkinson Shield and Marconi Cup is "]
["Wednesday 24th June but should rink availability be a problem for some clubs an alternative evening"]
["in the same week can be considered. Please notify the League Secretary of any alternative dates."]

{"sheet":"WinnerLossers","index":6,"n_rows":11,"n_cols":5,"rows_kept":11,"cut":false,"hidden":false,"merged":[[0,0,0,6]]}
["Winner / Lossers"]
[]
[]
[null,"Top","Second","Bottom 1","Bottom 2"]
["Div 1","Maldon A","Writtle A","Burham A","Danbury A"]
[]
["Div 2","Stock A","Tillingham","GtBaddow B","Lionmede"]
[]
["Div 3","Stock B","Falcon B","Danbury B","Maldon C"]
[]
["Div 4","PML","Burnham B"]

{"sheet":"Cum results","index":7,"n_rows":54,"n_cols":16,"rows_kept":54,"cut":false,"hidden":false,"merged":[[0,2,1,12],[28,2,29,12],[14,2,15,12],[43,2,44,11]]}
[null,null,"Division 1"]
[]
[]
[null,null,{"$f":"'Div 2'!$C$3:$E$3","v":"2026-05-06"},{"$f":"'Div 2'!$F$3:$F$3","v":"2026-05-13"},{"$f":"'Div 2'!$I$3:$I$3","v":"2026-05-20"},{"$f":"'Div 2'!$L$3:$L$3","v":"2026-05-27"},{"$f":"'Div 2'!$O$3:$O$3","v":"2026-06-03"},{"$f":"'Div 2'!$R$3:$R$3","v":"2026-06-10"},{"$f":"'Div 2'!$U$3:$U$3","v":"2026-06-17"},{"$f":"'Div 2'!$C$19:$C$19","v":"2026-07-01"},{"$f":"'Div 2'!$F$19:$F$19","v":"2026-07-08"},{"$f":"'Div 2'!$I$19:$I$19","v":"2026-07-15"},{"$f":"'Div 2'!$L$19:$L$19","v":"2026-07-22"},{"$f":"'Div 2'!$O$19:$O$19","v":"2026-07-29"},{"$f":"'Div 2'!$R$19:$R$19","v":"2026-08-05"},{"$f":"'Div 2'!$U$19:$U$19","v":"2026-08-12"}]
[null,null,1,2,3,4,5,6,7,8,9,10,11,12,13,14]
["A",{"$f":"'Div 1'!B6","v":"Burnham A"},{"$f":"'Div 1'!E6","v":8},{"$f":"C6+'Div 1'!H6","v":8},{"$f":"D6+'Div 1'!K6","v":8},{"$f":"E6+'Div 1'!N6","v":8},{"$f":"F6+'Div 1'!Q6","v":8},{"$f":"G6+'Div 1'!T6","v":8},{"$f":"H6+'Div 1'!W6","v":8},{"$f":"I6+'Div 1'!#REF!","v":{"$error":"#REF!"}},{"$f":"IF('Div 1'!$F$22=\"\",\"\",J6+'Div 1'!H22)","v":""},{"$f":"IF('Div 1'!$I$22=\"\",\"\",K6+'Div 1'!K22)","v":""},{"$f":"IF('Div 1'!$L$22=\"\",\"\",L6+'Div 1'!N22)","v":""},{"$f":"IF('Div 1'!$O$22=\"\",\"\",M6+'Div 1'!Q22)","v":""},{"$f":"IF('Div 1'!$R$22=\"\",\"\",N6+'Div 1'!T22)","v":""},{"$f":"IF('Div 1'!$U$22=\"\",\"\",O6+'Div 1'!W22)","v":""}]
["B",{"$f":"'Div 1'!B7","v":"Chelmsford A"},{"$f":"'Div 1'!E7","v":2},{"$f":"C7+'Div 1'!H7","v":2},{"$f":"D7+'Div 1'!K7","v":2},{"$f":"E7+'Div 1'!N7","v":2},{"$f":"F7+'Div 1'!Q7","v":2},{"$f":"G7+'Div 1'!T7","v":2},{"$f":"H7+'Div 1'!W7","v":2},{"$f":"I7+'Div 1'!E23","v":2},{"$f":"IF('Div 1'!$F$22=\"\",\"\",J7+'Div 1'!H23)","v":""},{"$f":"IF('Div 1'!$I$22=\"\",\"\",K7+'Div 1'!K23)","v":""},{"$f":"IF('Div 1'!$L$22=\"\",\"\",L7+'Div 1'!N23)","v":""},{"$f":"IF('Div 1'!$O$22=\"\",\"\",M7+'Div 1'!Q23)","v":""},{"$f":"IF('Div 1'!$R$22=\"\",\"\",N7+'Div 1'!T23)","v":""},{"$f":"IF('Div 1'!$U$22=\"\",\"\",O7+'Div 1'!W23)","v":""}]
["C",{"$f":"'Div 1'!B8","v":"Danbury A"},{"$f":"'Div 1'!E8","v":8},{"$f":"C8+'Div 1'!H8","v":8},{"$f":"D8+'Div 1'!K8","v":8},{"$f":"E8+'Div 1'!N8","v":8},{"$f":"F8+'Div 1'!Q8","v":8},{"$f":"G8+'Div 1'!T8","v":8},{"$f":"H8+'Div 1'!W8","v":8},{"$f":"I8+'Div 1'!E24","v":8},{"$f":"IF('Div 1'!$F$22=\"\",\"\",J8+'Div 1'!H24)","v":""},{"$f":"IF('Div 1'!$I$22=\"\",\"\",K8+'Div 1'!K24)","v":""},{"$f":"IF('Div 1'!$L$22=\"\",\"\",L8+'Div 1'!N24)","v":""},{"$f":"IF('Div 1'!$O$22=\"\",\"\",M8+'Div 1'!Q24)","v":""},{"$f":"IF('Div 1'!$R$22=\"\",\"\",N8+'Div 1'!T24)","v":""},{"$f":"IF('Div 1'!$U$22=\"\",\"\",O8+'Div 1'!W24)","v":""}]
["D",{"$f":"'Div 1'!B9","v":"Gt_Baddow A"},{"$f":"'Div 1'!E9","v":8},{"$f":"C9+'Div 1'!H9","v":8},{"$f":"D9+'Div 1'!K9","v":8},{"$f":"E9+'Div 1'!N9","v":8},{"$f":"F9+'Div 1'!Q9","v":8},{"$f":"G9+'Div 1'!T9","v":8},{"$f":"H9+'Div 1'!W9","v":8},{"$f":"I9+'Div 1'!E25","v":8},{"$f":"IF('Div 1'!$F$22=\"\",\"\",J9+'Div 1'!H25)","v":""},{"$f":"IF('Div 1'!$I$22=\"\",\"\",K9+'Div 1'!K25)","v":""},{"$f":"IF('Div 1'!$L$22=\"\",\"\",L9+'Div 1'!N25)","v":""},{"$f":"IF('Div 1'!$O$22=\"\",\"\",M9+'Div 1'!Q25)","v":""},{"$f":"IF('Div 1'!$R$22=\"\",\"\",N9+'Div 1'!T25)","v":""},{"$f":"IF('Div 1'!$U$22=\"\",\"\",O9+'Div 1'!W25)","v":""}]
["E",{"$f":"'Div 1'!B10","v":"Maldon A"},{"$f":"'Div 1'!E10","v":8},{"$f":"C10+'Div 1'!H10","v":8},{"$f":"D10+'Div 1'!K10","v":8},{"$f":"E10+'Div 1'!N10","v":8},{"$f":"F10+'Div 1'!Q10","v":8},{"$f":"G10+'Div 1'!T10","v":8},{"$f":"H10+'Div 1'!W10","v":8},{"$f":"I10+'Div 1'!E26","v":8},{"$f":"IF('Div 1'!$F$22=\"\",\"\",J10+'Div 1'!H26)","v":""},{"$f":"IF('Div 1'!$I$22=\"\",\"\",K10+'Div 1'!K26)","v":""},{"$f":"IF('Div 1'!$L$22=\"\",\"\",L10+'Div 1'!N26)","v":""},{"$f":"IF('Div 1'!$O$22=\"\",\"\",M10+'Div 1'!Q26)","v":""},{"$f":"IF('Div 1'!$R$22=\"\",\"\",N10+'Div 1'!T26)","v":""},{"$f":"IF('Div 1'!$U$22=\"\",\"\",O10+'Div 1'!W26)","v":""}]
["F",{"$f":"'Div 1'!B11","v":"Southminster"},{"$f":"'Div 1'!E11","v":2},{"$f":"C11+'Div 1'!H11","v":2},{"$f":"D11+'Div 1'!K11","v":2},{"$f":"E11+'Div 1'!N11","v":2},{"$f":"F11+'Div 1'!Q11","v":2},{"$f":"G11+'Div 1'!T11","v":2},{"$f":"H11+'Div 1'!W11","v":2},{"$f":"I11+'Div 1'!E27","v":2},{"$f":"IF('Div 1'!$F$22=\"\",\"\",J11+'Div 1'!H27)","v":""},{"$f":"IF('Div 1'!$I$22=\"\",\"\",K11+'Div 1'!K27)","v":""},{"$f":"IF('Div 1'!$L$22=\"\",\"\",L11+'Div 1'!N27)","v":""},{"$f":"IF('Div 1'!$O$22=\"\",\"\",M11+'Div 1'!Q27)","v":""},{"$f":"IF('Div 1'!$R$22=\"\",\"\",N11+'Div 1'!T27)","v":""},{"$f":"IF('Div 1'!$U$22=\"\",\"\",O11+'Div 1'!W27)","v":""}]
["G",{"$f":"'Div 1'!B12","v":"Stock A"},{"$f":"'Div 1'!E12","v":2},{"$f":"C12+'Div 1'!H12","v":2},{"$f":"D12+'Div 1'!K12","v":2},{"$f":"E12+'Div 1'!N12","v":2},{"$f":"F12+'Div 1'!Q12","v":2},{"$f":"G12+'Div 1'!T12","v":2},{"$f":"H12+'Div 1'!W12","v":2},{"$f":"I12+'Div 1'!E28","v":2},{"$f":"IF('Div 1'!$F$22=\"\",\"\",J12+'Div 1'!H28)","v":""},{"$f":"IF('Div 1'!$I$22=\"\",\"\",K12+'Div 1'!K28)","v":""},{"$f":"IF('Div 1'!$L$22=\"\",\"\",L12+'Div 1'!N28)","v":""},{"$f":"IF('Div 1'!$O$22=\"\",\"\",M12+'Div 1'!Q28)","v":""},{"$f":"IF('Div 1'!$R$22=\"\",\"\",N12+'Div 1'!T28)","v":""},{"$f":"IF('Div 1'!$U$22=\"\",\"\",O12+'Div 1'!W28)","v":""}]
["H",{"$f":"'Div 1'!B13","v":"Writtle A"},{"$f":"'Div 1'!E13","v":2},{"$f":"C13+'Div 1'!H13","v":2},{"$f":"D13+'Div 1'!K13","v":2},{"$f":"E13+'Div 1'!N13","v":2},{"$f":"F13+'Div 1'!Q13","v":2},{"$f":"G13+'Div 1'!T13","v":2},{"$f":"H13+'Div 1'!W13","v":2},{"$f":"I13+'Div 1'!E29","v":2},{"$f":"IF('Div 1'!$F$22=\"\",\"\",J13+'Div 1'!H29)","v":""},{"$f":"IF('Div 1'!$I$22=\"\",\"\",K13+'Div 1'!K29)","v":""},{"$f":"IF('Div 1'!$L$22=\"\",\"\",L13+'Div 1'!N29)","v":""},{"$f":"IF('Div 1'!$O$22=\"\",\"\",M13+'Div 1'!Q29)","v":""},{"$f":"IF('Div 1'!$R$22=\"\",\"\",N13+'Div 1'!T29)","v":""},{"$f":"IF('Div 1'!$U$22=\"\",\"\",O13+'Div 1'!W29)","v":""}]
[]
[null,null,"Division 2"]
[]
[]
[null,null,{"$f":"'Div 2'!$C$3:$E$3","v":"2026-05-06"},{"$f":"'Div 2'!$F$3:$F$3","v":"2026-05-13"},{"$f":"'Div 2'!$I$3:$I$3","v":"2026-05-20"},{"$f":"'Div 2'!$L$3:$L$3","v":"2026-05-27"},{"$f":"'Div 2'!$O$3:$O$3","v":"2026-06-03"},{"$f":"'Div 2'!$R$3:$R$3","v":"2026-06-10"},{"$f":"'Div 2'!$U$3:$U$3","v":"2026-06-17"},{"$f":"'Div 2'!$C$19:$C$19","v":"2026-07-01"},{"$f":"'Div 2'!$F$19:$F$19","v":"2026-07-08"},{"$f":"'Div 2'!$I$19:$I$19","v":"2026-07-15"},{"$f":"'Div 2'!$L$19:$L$19","v":"2026-07-22"},{"$f":"'Div 2'!$O$19:$O$19","v":"2026-07-29"},{"$f":"'Div 2'!$R$19:$R$19","v":"2026-08-05"},{"$f":"'Div 2'!$U$19:$U$19","v":"2026-08-12"}]
[null,null,1,2,3,4,5,6,7,8,9,10,11,12,13,14]
["A",{"$f":"'Div 2'!B6","v":"Falcon A"},{"$f":"'Div 2'!E6","v":8},{"$f":"C20+'Div 2'!H6","v":8},{"$f":"D20+'Div 2'!K6","v":8},{"$f":"E20+'Div 2'!N6","v":8},{"$f":"F20+'Div 2'!T6","v":8},{"$f":"G20+'Div 2'!T6","v":8},{"$f":"H20+'Div 2'!W6","v":8},{"$f":"IF('Div 2'!C22=\"\",\"\",I20+'Div 2'!E22)","v":""},{"$f":"IF('Div 2'!F22=\"\",\"\",J20+'Div 2'!H22)","v":""},{"$f":"IF('Div 2'!I22=\"\",\"\",K20+'Div 2'!K22)","v":""},{"$f":"IF('Div 2'!L22=\"\",\"\",L20+'Div 2'!N22)","v":""},{"$f":"IF('Div 2'!O22=\"\",\"\",M20+'Div 2'!Q22)","v":""},{"$f":"IF('Div 2'!R22=\"\",\"\",N20+'Div 2'!T22)","v":""},{"$f":"IF('Div 2'!U22=\"\",\"\",O20+'Div 2'!W22)","v":""}]
["B",{"$f":"'Div 2'!B7","v":"Lionmede"},{"$f":"'Div 2'!E7","v":8},{"$f":"C21+'Div 2'!H7","v":8},{"$f":"D21+'Div 2'!K7","v":8},{"$f":"E21+'Div 2'!N7","v":8},{"$f":"F21+'Div 2'!T7","v":8},{"$f":"G21+'Div 2'!T7","v":8},{"$f":"H21+'Div 2'!W7","v":8},{"$f":"IF('Div 2'!C23=\"\",\"\",I21+'Div 2'!E23)","v":""},{"$f":"IF('Div 2'!F23=\"\",\"\",J21+'Div 2'!H23)","v":""},{"$f":"IF('Div 2'!I23=\"\",\"\",K21+'Div 2'!K23)","v":""},{"$f":"IF('Div 2'!L23=\"\",\"\",L21+'Div 2'!N23)","v":""},{"$f":"IF('Div 2'!O23=\"\",\"\",M21+'Div 2'!Q23)","v":""},{"$f":"IF('Div 2'!R23=\"\",\"\",N21+'Div 2'!T23)","v":""},{"$f":"IF('Div 2'!U23=\"\",\"\",O21+'Div 2'!W23)","v":""}]
["C",{"$f":"'Div 2'!B8","v":"Maldon B"},{"$f":"'Div 2'!E8","v":2},{"$f":"C22+'Div 2'!H8","v":2},{"$f":"D22+'Div 2'!K8","v":2},{"$f":"E22+'Div 2'!N8","v":2},{"$f":"F22+'Div 2'!T8","v":2},{"$f":"G22+'Div 2'!T8","v":2},{"$f":"H22+'Div 2'!W8","v":2},{"$f":"IF('Div 2'!C24=\"\",\"\",I22+'Div 2'!E24)","v":""},{"$f":"IF('Div 2'!F24=\"\",\"\",J22+'Div 2'!H24)","v":""},{"$f":"IF('Div 2'!I24=\"\",\"\",K22+'Div 2'!K24)","v":""},{"$f":"IF('Div 2'!L24=\"\",\"\",L22+'Div 2'!N24)","v":""},{"$f":"IF('Div 2'!O24=\"\",\"\",M22+'Div 2'!Q24)","v":""},{"$f":"IF('Div 2'!R24=\"\",\"\",N22+'Div 2'!T24)","v":""},{"$f":"IF('Div 2'!U24=\"\",\"\",O22+'Div 2'!W24)","v":""}]
["D",{"$f":"'Div 2'!B9","v":"RHP A"},{"$f":"'Div 2'!E9","v":2},{"$f":"C23+'Div 2'!H9","v":2},{"$f":"D23+'Div 2'!K9","v":2},{"$f":"E23+'Div 2'!N9","v":2},{"$f":"F23+'Div 2'!T9","v":2},{"$f":"G23+'Div 2'!T9","v":2},{"$f":"H23+'Div 2'!W9","v":2},{"$f":"IF('Div 2'!C25=\"\",\"\",I23+'Div 2'!E25)","v":""},{"$f":"IF('Div 2'!F25=\"\",\"\",J23+'Div 2'!H25)","v":""},{"$f":"IF('Div 2'!I25=\"\",\"\",K23+'Div 2'!K25)","v":""},{"$f":"IF('Div 2'!L25=\"\",\"\",L23+'Div 2'!N25)","v":""},{"$f":"IF('Div 2'!O25=\"\",\"\",M23+'Div 2'!Q25)","v":""},{"$f":"IF('Div 2'!R25=\"\",\"\",N23+'Div 2'!T25)","v":""},{"$f":"IF('Div 2'!U25=\"\",\"\",O23+'Div 2'!W25)","v":""}]
["E",{"$f":"'Div 2'!B10","v":"Stock B"},{"$f":"'Div 2'!E10","v":6},{"$f":"C24+'Div 2'!H10","v":6},{"$f":"D24+'Div 2'!K10","v":6},{"$f":"E24+'Div 2'!N10","v":6},{"$f":"F24+'Div 2'!T10","v":6},{"$f":"G24+'Div 2'!T10","v":6},{"$f":"H24+'Div 2'!W10","v":6},{"$f":"IF('Div 2'!C26=\"\",\"\",I24+'Div 2'!E26)","v":""},{"$f":"IF('Div 2'!F26=\"\",\"\",J24+'Div 2'!H26)","v":""},{"$f":"IF('Div 2'!I26=\"\",\"\",K24+'Div 2'!K26)","v":""},{"$f":"IF('Div 2'!L26=\"\",\"\",L24+'Div 2'!N26)","v":""},{"$f":"IF('Div 2'!O26=\"\",\"\",M24+'Div 2'!Q26)","v":""},{"$f":"IF('Div 2'!R26=\"\",\"\",N24+'Div 2'!T26)","v":""},{"$f":"IF('Div 2'!U26=\"\",\"\",O24+'Div 2'!W26)","v":""}]
["F",{"$f":"'Div 2'!B11","v":"SWF"},{"$f":"'Div 2'!E11","v":6},{"$f":"C25+'Div 2'!H11","v":6},{"$f":"D25+'Div 2'!K11","v":6},{"$f":"E25+'Div 2'!N11","v":6},{"$f":"F25+'Div 2'!T11","v":6},{"$f":"G25+'Div 2'!T11","v":6},{"$f":"H25+'Div 2'!W11","v":6},{"$f":"IF('Div 2'!C27=\"\",\"\",I25+'Div 2'!E27)","v":""},{"$f":"IF('Div 2'!F27=\"\",\"\",J25+'Div 2'!H27)","v":""},{"$f":"IF('Div 2'!I27=\"\",\"\",K25+'Div 2'!K27)","v":""},{"$f":"IF('Div 2'!L27=\"\",\"\",L25+'Div 2'!N27)","v":""},{"$f":"IF('Div 2'!O27=\"\",\"\",M25+'Div 2'!Q27)","v":""},{"$f":"IF('Div 2'!R27=\"\",\"\",N25+'Div 2'!T27)","v":""},{"$f":"IF('Div 2'!U27=\"\",\"\",O25+'Div 2'!W27)","v":""}]
["G",{"$f":"'Div 2'!B12","v":"Tillingham"},{"$f":"'Div 2'!E12","v":4},{"$f":"C26+'Div 2'!H12","v":4},{"$f":"D26+'Div 2'!K12","v":4},{"$f":"E26+'Div 2'!N12","v":4},{"$f":"F26+'Div 2'!T12","v":4},{"$f":"G26+'Div 2'!T12","v":4},{"$f":"H26+'Div 2'!W12","v":4},{"$f":"IF('Div 2'!C28=\"\",\"\",I26+'Div 2'!E28)","v":""},{"$f":"IF('Div 2'!F28=\"\",\"\",J26+'Div 2'!H28)","v":""},{"$f":"IF('Div 2'!I28=\"\",\"\",K26+'Div 2'!K28)","v":""},{"$f":"IF('Div 2'!L28=\"\",\"\",L26+'Div 2'!N28)","v":""},{"$f":"IF('Div 2'!O28=\"\",\"\",M26+'Div 2'!Q28)","v":""},{"$f":"IF('Div 2'!R28=\"\",\"\",N26+'Div 2'!T28)","v":""},{"$f":"IF('Div 2'!U28=\"\",\"\",O26+'Div 2'!W28)","v":""}]
["H",{"$f":"'Div 2'!B13","v":"Writtle B"},{"$f":"'Div 2'!E13","v":4},{"$f":"C27+'Div 2'!H13","v":4},{"$f":"D27+'Div 2'!K13","v":4},{"$f":"E27+'Div 2'!N13","v":4},{"$f":"F27+'Div 2'!T13","v":4},{"$f":"G27+'Div 2'!T13","v":4},{"$f":"H27+'Div 2'!W13","v":4},{"$f":"IF('Div 2'!C29=\"\",\"\",I27+'Div 2'!E29)","v":""},{"$f":"IF('Div 2'!F29=\"\",\"\",J27+'Div 2'!H29)","v":""},{"$f":"IF('Div 2'!I29=\"\",\"\",K27+'Div 2'!K29)","v":""},{"$f":"IF('Div 2'!L29=\"\",\"\",L27+'Div 2'!N29)","v":""},{"$f":"IF('Div 2'!O29=\"\",\"\",M27+'Div 2'!Q29)","v":""},{"$f":"IF('Div 2'!R29=\"\",\"\",N27+'Div 2'!T29)","v":""},{"$f":"IF('Div 2'!U29=\"\",\"\",O27+'Div 2'!W29)","v":""}]
[]
[null,null,"Division 3"]
[]
[]
[]
[null,null,{"$f":"'Div 3'!$C$3:$E$3","v":"2026-05-06"},{"$f":"'Div 3'!$F$3:$F$3","v":"2026-05-13"},{"$f":"'Div 3'!$I$3:$I$3","v":"2026-05-20"},{"$f":"'Div 3'!$L$3:$L$3","v":"2026-05-27"},{"$f":"'Div 3'!$O$3:$O$3","v":"2026-06-03"},{"$f":"'Div 3'!$R$3:$R$3","v":"2026-06-10"},{"$f":"'Div 3'!$U$3:$U$3","v":"2026-06-17"},{"$f":"'Div 3'!$C$19:$C$19","v":"2026-07-01"},{"$f":"'Div 3'!$F$19:$F$19","v":"2026-07-08"},{"$f":"'Div 3'!$I$19:$I$19","v":"2026-07-15"},{"$f":"'Div 3'!$L$19:$L$19","v":"2026-07-22"},{"$f":"'Div 3'!$O$19:$O$19","v":"2026-07-29"},{"$f":"'Div 3'!$R$19:$R$19","v":"2026-08-05"},{"$f":"'Div 3'!$U$19:$U$19","v":"2026-08-12"}]
[null,null,1,2,3,4,5,6,7,8,9,10,11,12,13,14]
["A","Burnham B",{"$f":"'Div 3'!E6","v":4},{"$f":"C35+'Div 3'!H6","v":4},{"$f":"D35+'Div 3'!K6","v":4},{"$f":"E35+'Div 3'!N6","v":4},{"$f":"F35+'Div 3'!Q6","v":4},{"$f":"G35+'Div 3'!T6","v":4},{"$f":"H35+'Div 3'!W6","v":4},{"$f":"I35+'Div 3'!E22","v":4},{"$f":"IF('Div 3'!F22=\"\",\"\",J35+'Div 3'!H22)","v":""},{"$f":"IF('Div 3'!I22=\"\",\"\",K35+'Div 3'!K22)","v":""},{"$f":"IF('Div 3'!L22=\"\",\"\",L35+'Div 3'!N22)","v":""},{"$f":"IF('Div 3'!O22=\"\",\"\",M35+'Div 3'!Q22)","v":""},{"$f":"IF('Div 3'!R22=\"\",\"\",N35+'Div 3'!T22)","v":""},{"$f":"IF('Div 3'!U22=\"\",\"\",O35+'Div 3'!W22)","v":""}]
["B","Chelmsford B",{"$f":"'Div 3'!E7","v":4},{"$f":"C36+'Div 3'!H7","v":4},{"$f":"D36+'Div 3'!K7","v":4},{"$f":"E36+'Div 3'!N7","v":4},{"$f":"F36+'Div 3'!Q7","v":4},{"$f":"G36+'Div 3'!T7","v":4},{"$f":"H36+'Div 3'!W7","v":4},{"$f":"I36+'Div 3'!E23","v":4},{"$f":"IF('Div 3'!$F$22=\"\",\"\",J36+'Div 3'!H23)","v":""},{"$f":"IF('Div 3'!$I$22=\"\",\"\",K36+'Div 3'!K23)","v":""},{"$f":"IF('Div 3'!$L$22=\"\",\"\",L36+'Div 3'!N23)","v":""},{"$f":"IF('Div 3'!$O$22=\"\",\"\",M36+'Div 3'!Q23)","v":""},{"$f":"IF('Div 3'!$R$22=\"\",\"\",N36+'Div 3'!T23)","v":""},{"$f":"IF('Div 3'!$U$22=\"\",\"\",O36+'Div 3'!W23)","v":""}]
["C","Danbury B",{"$f":"'Div 3'!E8","v":2},{"$f":"C37+'Div 3'!H8","v":2},{"$f":"D37+'Div 3'!K8","v":2},{"$f":"E37+'Div 3'!N8","v":2},{"$f":"F37+'Div 3'!Q8","v":2},{"$f":"G37+'Div 3'!T8","v":2},{"$f":"H37+'Div 3'!W8","v":2},{"$f":"I37+'Div 3'!E24","v":2},{"$f":"IF('Div 3'!$F$22=\"\",\"\",J37+'Div 3'!H24)","v":""},{"$f":"IF('Div 3'!$I$22=\"\",\"\",K37+'Div 3'!K24)","v":""},{"$f":"IF('Div 3'!$L$22=\"\",\"\",L37+'Div 3'!N24)","v":""},{"$f":"IF('Div 3'!$O$22=\"\",\"\",M37+'Div 3'!Q24)","v":""},{"$f":"IF('Div 3'!$R$22=\"\",\"\",N37+'Div 3'!T24)","v":""},{"$f":"IF('Div 3'!$U$22=\"\",\"\",O37+'Div 3'!W24)","v":""}]
["D","Ingatestone",{"$f":"'Div 3'!E9","v":2},{"$f":"C38+'Div 3'!H9","v":2},{"$f":"D38+'Div 3'!K9","v":2},{"$f":"E38+'Div 3'!N9","v":2},{"$f":"F38+'Div 3'!Q9","v":2},{"$f":"G38+'Div 3'!T9","v":2},{"$f":"H38+'Div 3'!W9","v":2},{"$f":"I38+'Div 3'!E25","v":2},{"$f":"IF('Div 3'!$F$22=\"\",\"\",J38+'Div 3'!H25)","v":""},{"$f":"IF('Div 3'!$I$22=\"\",\"\",K38+'Div 3'!K25)","v":""},{"$f":"IF('Div 3'!$L$22=\"\",\"\",L38+'Div 3'!N25)","v":""},{"$f":"IF('Div 3'!$O$22=\"\",\"\",M38+'Div 3'!Q25)","v":""},{"$f":"IF('Div 3'!$R$22=\"\",\"\",N38+'Div 3'!T25)","v":""},{"$f":"IF('Div 3'!$U$22=\"\",\"\",O38+'Div 3'!W25)","v":""}]
["E","Maldon B",{"$f":"'Div 3'!E10","v":6},{"$f":"C39+'Div 3'!H10","v":6},{"$f":"D39+'Div 3'!K10","v":6},{"$f":"E39+'Div 3'!N10","v":6},{"$f":"F39+'Div 3'!Q10","v":6},{"$f":"G39+'Div 3'!T10","v":6},{"$f":"H39+'Div 3'!W10","v":6},{"$f":"I39+'Div 3'!E26","v":6},{"$f":"IF('Div 3'!$F$22=\"\",\"\",J39+'Div 3'!H26)","v":""},{"$f":"IF('Div 3'!$I$22=\"\",\"\",K39+'Div 3'!K26)","v":""},{"$f":"IF('Div 3'!$L$22=\"\",\"\",L39+'Div 3'!N26)","v":""},{"$f":"IF('Div 3'!$O$22=\"\",\"\",M39+'Div 3'!Q26)","v":""},{"$f":"IF('Div 3'!$R$22=\"\",\"\",N39+'Div 3'!T26)","v":""},{"$f":"IF('Div 3'!$U$22=\"\",\"\",O39+'Div 3'!W26)","v":""}]
["F","PML",{"$f":"'Div 3'!E11","v":6},{"$f":"C40+'Div 3'!H11","v":6},{"$f":"D40+'Div 3'!K11","v":6},{"$f":"E40+'Div 3'!N11","v":6},{"$f":"F40+'Div 3'!Q11","v":6},{"$f":"G40+'Div 3'!T11","v":6},{"$f":"H40+'Div 3'!W11","v":6},{"$f":"I40+'Div 3'!E27","v":6},{"$f":"IF('Div 3'!$F$22=\"\",\"\",J40+'Div 3'!H27)","v":""},{"$f":"IF('Div 3'!$I$22=\"\",\"\",K40+'Div 3'!K27)","v":""},{"$f":"IF('Div 3'!$L$22=\"\",\"\",L40+'Div 3'!N27)","v":""},{"$f":"IF('Div 3'!$O$22=\"\",\"\",M40+'Div 3'!Q27)","v":""},{"$f":"IF('Div 3'!$R$22=\"\",\"\",N40+'Div 3'!T27)","v":""},{"$f":"IF('Div 3'!$U$22=\"\",\"\",O40+'Div 3'!W27)","v":""}]
["G","Stock B",{"$f":"'Div 3'!E12","v":8},{"$f":"C41+'Div 3'!H12","v":8},{"$f":"D41+'Div 3'!K12","v":8},{"$f":"E41+'Div 3'!N12","v":8},{"$f":"F41+'Div 3'!Q12","v":8},{"$f":"G41+'Div 3'!T12","v":8},{"$f":"H41+'Div 3'!W12","v":8},{"$f":"I41+'Div 3'!E28","v":8},{"$f":"IF('Div 3'!$F$22=\"\",\"\",J41+'Div 3'!H28)","v":""},{"$f":"IF('Div 3'!$I$22=\"\",\"\",K41+'Div 3'!K28)","v":""},{"$f":"IF('Div 3'!$L$22=\"\",\"\",L41+'Div 3'!N28)","v":""},{"$f":"IF('Div 3'!$O$22=\"\",\"\",M41+'Div 3'!Q28)","v":""},{"$f":"IF('Div 3'!$R$22=\"\",\"\",N41+'Div 3'!T28)","v":""},{"$f":"IF('Div 3'!$U$22=\"\",\"\",O41+'Div 3'!W28)","v":""}]
["H","SWF",{"$f":"'Div 3'!E13","v":8},{"$f":"C42+'Div 3'!H13","v":8},{"$f":"D42+'Div 3'!K13","v":8},{"$f":"E42+'Div 3'!N13","v":8},{"$f":"F42+'Div 3'!Q13","v":8},{"$f":"G42+'Div 3'!T13","v":8},{"$f":"H42+'Div 3'!W13","v":8},{"$f":"I42+'Div 3'!E29","v":8},{"$f":"IF('Div 3'!$F$22=\"\",\"\",J42+'Div 3'!H29)","v":""},{"$f":"IF('Div 3'!$I$22=\"\",\"\",K42+'Div 3'!K29)","v":""},{"$f":"IF('Div 3'!$L$22=\"\",\"\",L42+'Div 3'!N29)","v":""},{"$f":"IF('Div 3'!$O$22=\"\",\"\",M42+'Div 3'!Q29)","v":""},{"$f":"IF('Div 3'!$R$22=\"\",\"\",N42+'Div 3'!T29)","v":""},{"$f":"IF('Div 3'!$U$22=\"\",\"\",O42+'Div 3'!W29)","v":""}]
[]
[null,null,"Division 4"]
[]
[]
[null,null,{"$f":"'Div 4'!$C$3:$E$3","v":"2025-05-13"},{"$f":"'Div 4'!$F$3:$F$3","v":"2026-05-20"},{"$f":"'Div 4'!$I$3:$I$3","v":"2026-05-27"},{"$f":"'Div 4'!$L$3:$L$3","v":"2025-06-10"},{"$f":"'Div 4'!$O$3:$O$3","v":"2026-06-17"},{"$f":"'Div 4'!$C$16:$C$16","v":"2026-07-01"},{"$f":"'Div 4'!$F$16:$F$16","v":"2026-07-15"},{"$f":"'Div 4'!$I$16:$I$16","v":"2026-07-29"},{"$f":"'Div 4'!$L$16:$L$16","v":"2026-08-05"},{"$f":"'Div 4'!$O$16:$O$16","v":"2026-08-12"}]
[null,null,1,2,3,4,5,6,7,8,9,10]
["A",{"$f":"'Div 4'!B6","v":"Burnham B"},{"$f":"'Div 4'!E6","v":0},{"$f":"C49+'Div 4'!H6","v":0},{"$f":"D49+'Div 4'!K6","v":0},{"$f":"E49+'Div 4'!N6","v":0},{"$f":"F49+'Div 4'!Q6","v":0},{"$f":"IF('Div 4'!$C$19=\"\",\"\",G49+'Div 4'!E19)","v":""},{"$f":"IF('Div 4'!$F$19=\"\",\"\",H49+'Div 4'!H19)","v":""},{"$f":"IF('Div 4'!$I$19=\"\",\"\",I49+'Div 4'!K19)","v":""},{"$f":"IF('Div 4'!$L$19=\"\",\"\",J49+'Div 4'!N19)","v":""},{"$f":"IF('Div 4'!$O$19=\"\",\"\",K49+'Div 4'!Q19)","v":""}]
["B",{"$f":"'Div 4'!B7","v":"Falcon C"},{"$f":"'Div 4'!E7","v":0},{"$f":"C50+'Div 4'!H7","v":0},{"$f":"D50+'Div 4'!K7","v":0},{"$f":"E50+'Div 4'!N7","v":0},{"$f":"F50+'Div 4'!Q7","v":0},{"$f":"IF('Div 4'!$C$19=\"\",\"\",G50+'Div 4'!E20)","v":""},{"$f":"IF('Div 4'!$F$19=\"\",\"\",H50+'Div 4'!H20)","v":""},{"$f":"IF('Div 4'!$I$19=\"\",\"\",I50+'Div 4'!K20)","v":""},{"$f":"IF('Div 4'!$L$19=\"\",\"\",J50+'Div 4'!N20)","v":""},{"$f":"IF('Div 4'!$O$19=\"\",\"\",K50+'Div 4'!Q20)","v":""}]
["C",{"$f":"'Div 4'!B8","v":"Gt_Baddow C"},{"$f":"'Div 4'!E8","v":0},{"$f":"C51+'Div 4'!H8","v":0},{"$f":"D51+'Div 4'!K8","v":0},{"$f":"E51+'Div 4'!N8","v":0},{"$f":"F51+'Div 4'!Q8","v":0},{"$f":"IF('Div 4'!$C$19=\"\",\"\",G51+'Div 4'!E21)","v":""},{"$f":"IF('Div 4'!$F$19=\"\",\"\",H51+'Div 4'!H21)","v":""},{"$f":"IF('Div 4'!$I$19=\"\",\"\",I51+'Div 4'!K21)","v":""},{"$f":"IF('Div 4'!$L$19=\"\",\"\",J51+'Div 4'!N21)","v":""},{"$f":"IF('Div 4'!$O$19=\"\",\"\",K51+'Div 4'!Q21)","v":""}]
["D",{"$f":"'Div 4'!B9","v":"Stock C"},{"$f":"'Div 4'!E9","v":0},{"$f":"C52+'Div 4'!H9","v":0},{"$f":"D52+'Div 4'!K9","v":0},{"$f":"E52+'Div 4'!N9","v":0},{"$f":"F52+'Div 4'!Q9","v":0},{"$f":"IF('Div 4'!$C$19=\"\",\"\",G52+'Div 4'!E22)","v":""},{"$f":"IF('Div 4'!$F$19=\"\",\"\",H52+'Div 4'!H22)","v":""},{"$f":"IF('Div 4'!$I$19=\"\",\"\",I52+'Div 4'!K22)","v":""},{"$f":"IF('Div 4'!$L$19=\"\",\"\",J52+'Div 4'!N22)","v":""},{"$f":"IF('Div 4'!$O$19=\"\",\"\",K52+'Div 4'!Q22)","v":""}]
["E",{"$f":"'Div 4'!B10","v":"Writtle C"},{"$f":"'Div 4'!E10","v":0},{"$f":"C53+'Div 4'!H10","v":0},{"$f":"D53+'Div 4'!K10","v":0},{"$f":"E53+'Div 4'!N10","v":0},{"$f":"F53+'Div 4'!Q10","v":0},{"$f":"IF('Div 4'!$C$19=\"\",\"\",G53+'Div 4'!E23)","v":""},{"$f":"IF('Div 4'!$F$19=\"\",\"\",H53+'Div 4'!H23)","v":""},{"$f":"IF('Div 4'!$I$19=\"\",\"\",I53+'Div 4'!K23)","v":""},{"$f":"IF('Div 4'!$L$19=\"\",\"\",J53+'Div 4'!N23)","v":""},{"$f":"IF('Div 4'!$O$19=\"\",\"\",K53+'Div 4'!Q23)","v":""}]
["F",{"$f":"'Div 4'!#REF!","v":{"$error":"#REF!"}},{"$f":"'Div 4'!#REF!","v":{"$error":"#REF!"}},{"$f":"C54+'Div 4'!#REF!","v":{"$error":"#REF!"}},{"$f":"D54+'Div 4'!#REF!","v":{"$error":"#REF!"}},{"$f":"E54+'Div 4'!#REF!","v":{"$error":"#REF!"}},{"$f":"F54+'Div 4'!#REF!","v":{"$error":"#REF!"}},{"$f":"IF('Div 4'!$C$19=\"\",\"\",G54+'Div 4'!#REF!)","v":""},{"$f":"IF('Div 4'!$F$19=\"\",\"\",H54+'Div 4'!#REF!)","v":""},{"$f":"IF('Div 4'!$I$19=\"\",\"\",I54+'Div 4'!#REF!)","v":""},{"$f":"IF('Div 4'!$L$19=\"\",\"\",J54+'Div 4'!#REF!)","v":""},{"$f":"IF('Div 4'!$O$19=\"\",\"\",K54+'Div 4'!#REF!)","v":""}]